{"text_format":"3","workbook":"xlsx","n_sheets":12,"sheets":["お取り扱い(最初にお読みください）","メインメニュー","1事務受託様式５号","2事務受託様式４号","3共済契約者別一覧","4事務受託様式２号","5様式５号（二次）","6様式４号（二次）","7様式２号（二次）","8様式５号（二次）","9様式４号（二次）","10様式２号（二次）"],"not_rendered":{"macros":1,"defined_names":12,"comments":9},"read":"whole","date_system":"1900"}

{"sheet":"お取り扱い(最初にお読みください）","index":0,"n_rows":39,"n_cols":3,"rows_kept":39}
[]
[null,"｢就労状況報告書｣の作成、提出上のお取り扱い"]
[]
[null,"１．書類入力方法"]
[null,"　　 ① エクセルシート「1事務受託様式５号」の青色箇所の部分"]
[null,"　　　　・報告事業者名、住所、電話番号、共済契約者番号、工事名を入力して下さい。"]
[null,"　　　　・キャリアアップシステムに加入している場合は事業者ＩＤを入力して下さい。"]
[null,"　　　　・報告日には提出日を入力して下さい。"]
[null,"　　　　・被共済者番号、氏名、就労日、期間を入力して下さい。"]
[]
[null,"　　 ② エクセルシート「2事務受託様式４号」、「3共済契約者別一覧」には自動的に"]
[null,"　　　　入力されます。"]
[]
[null,"　　 ③ 二次下請け会社が有る場合は「5様式５号（二次）」、「8様式５号（二次）」に"]
[null,"　　　　入力して下さい。"]
[]
[null,"　　 ④「4事務受託様式２号」には自動的に入力されます。"]
[]
[null,"２．書類提出方法"]
[null,"　　 ① ｢就労状況報告書｣の提出先"]
[null,"　  　　㈱泰進建設滝川本店の安全衛生部安全衛生課までにエクセルデータをメールして下さい。"]
[null,"        メールアドレス　takikawa-r@kktaishin.co.jp"]
[]
[null,"　　 ② 提出時期は毎月末締め翌月10日までに提出して下さい。"]
[null,"　　  　ただし、就労工事が終了した場合は、月末を待たずに速やかに提出して下さい。"]
[]
[null,"　　 ③ 当社で被共済者数、延べ就労日数を確認し、「4事務受託様式２号」の受領書を"]
[null,"　　　　証紙と共に郵送致します。"]
[]
[null,"　　 ④ 届いた証紙を確認して頂き、「4事務受託様式２号」の受領書に受領日、会社名、"]
[null,"　　 　 会社印を押して頂き、枚数を記入の上、郵送にて提出して下さい。"]
[]
[]
[]
[]
[]
[null,null,"なお、ご不明な点がありましたら、次までお問い合わせください。"]
[null,"　","安全衛生部安全衛生課"]
[null,"　","連絡先　TEL 0125-22-4355　FAX 0125-23-5408"]

{"sheet":"メインメニュー","index":1,"n_rows":5,"n_cols":12,"rows_kept":5,"merged":[[1,3,3,11]]}
[]
[{"$nulls":3},"元請・下請間における就労実績報告（月別報告版）"]
[]
[]
[{"$nulls":9},"各様式",null,"入力項目"]

{"sheet":"1事務受託様式５号","index":2,"n_rows":68,"n_cols":39,"rows_kept":68,"merged":[[1,0,1,36],[2,23,2,26],[2,27,2,36],[3,1,3,6],[3,7,3,9],[3,23,3,26],[3,27,3,36],[5,1,5,2],[5,4,5,25],[5,28,5,36],[6,1,6,2],[6,4,6,25],[6,28,7,29],[6,30,7,36],[7,1,7,2],[7,4,7,25],[8,1,8,2],[8,4,8,25],[8,28,10,29],[8,30,10,36],[9,1,9,2],[9,4,10,25],[10,1,10,2],[11,1,11,2],[11,4,12,25],[12,1,12,2],[13,1,13,2],[13,4,13,25],[13,28,13,36],[14,1,14,2],[14,4,15,25],[14,28,16,36],[15,1,15,2],[16,1,16,2],[16,4,16,25],[18,1,18,2],[18,4,18,14],[18,16,18,21],[18,23,18,36],[19,1,19,2],[19,4,19,14],[19,16,19,21],[19,23,19,36],[21,1,21,11],[21,12,21,14],[21,15,21,21],[21,23,21,35],[22,0,23,0],[22,1,23,2],[22,3,23,3],[22,4,23,4],[22,10,22,14],[22,16,22,22],[22,24,22,30],[22,37,23,37],[24,1,24,2],[25,1,25,2],[26,1,26,2],[27,1,27,2],[28,1,28,2],[29,1,29,2],[30,1,30,2],[31,1,31,2],[32,1,32,2],[33,1,33,2],[34,1,34,2],[35,1,35,2],[36,1,36,2],[37,1,37,2],[38,1,38,2],[39,1,39,2],[40,1,40,2],[41,1,41,2],[42,1,42,2],[43,1,43,2],[44,0,44,35],[67,37,68,37]]}
["　　　建退共事務受託様式５号"]
["被共済者就労状況報告書（日別報告様式）"]
[{"$nulls":23},"整理番号"]
[null,"株式会社　泰進建設",{"$nulls":5},"殿",{"$nulls":15},"報告日",{"$nulls":3},"2022-05-05"]
[]
[null,"報告事業所名",null,null,"ＫＫ建設　株式会社"]
[null,"住所",null,null,"〒111-9999　滝川市　GG町１丁目",{"$nulls":23},"　",null,"掛金納付についての\n事務を委託します。"]
[null,"電話番号",null,null,"0125-55-6666"]
[null,"共済契約者\n番号",null,null,"22-33333",{"$nulls":23},"　",null,"就労実績の集計に建設\nキャリアアップシステムを\n活用しています。"]
[null,"建設キャリアアップシステム",null,null,1122334455]
[null,"事業者ⅠD"]
[null,"工事番号および",null,null,"１２３４　　経営体　ＫＫ地区　８８工区　工事"]
[null,"工事名"]
[null,"工事コード",{"$nulls":26},"現場責任者確認"]
[null,"建設キャリアアップシステム",null,null,6677889900]
[null,"現場ⅠD"]
[null,"備考"]
[]
[null,"(契約者番号)",null,null,"51-00200",{"$nulls":11},"(契約者番号)",{"$nulls":6},{"$f":"E9","v":"22-33333"}]
[null,"元請事業所名",null,null,{"$f":"B4","v":"株式会社　泰進建設"},{"$nulls":11},"一次事業所名",{"$nulls":6},{"$f":"E6","v":"ＫＫ建設　株式会社"}]
[]
[null,"次の表のとおり、就労実績を報告します。"]
["No.","被共済者番号",null,"項番","氏　名",{"$nulls":5},"就労状況",{"$nulls":5},"2022-04-01",{"$nulls":6},"～","2022-04-30",{"$nulls":12},"CCUS"]
[{"$nulls":5},1,2,3,4,5,6,7,8,9,10,11,12,13,14,15,16,17,18,19,20,21,22,23,24,25,26,27,28,29,30,31,"就労日数"]
[1,"01-0000001",null,null,"ああ　ああ",1,1,1,1,1,null,null,1,1,1,1,1,null,null,1,1,1,1,1,null,null,1,1,1,1,1,null,1,1,1,null,{"$f":"SUM(F25:AJ25)","v":23},"○",{"$f":"IF(E25=\"\",0,1)","v":1}]
[2,"01-0000002",null,null,"ああ　あああ",1,1,null,1,1,null,null,1,1,1,null,1,null,null,1,1,1,1,1,null,null,1,1,1,{"$nulls":7},{"$f":"SUM(F26:AJ26)","v":16},"　",1]
[3,"01-0000003",null,null,"いい　いい",{"$nulls":7},1,1,1,1,1,null,null,1,1,1,1,1,null,null,1,1,1,1,1,null,1,1,1,null,18,"　",1]
[4,"01-0000004",null,null,"うう　ううう",{"$nulls":7},1,1,1,1,1,null,null,1,1,1,1,1,null,null,1,1,1,1,1,{"$nulls":5},15,"　",1]
[5,"01-0000005",null,null,"ええ　えええ",{"$nulls":7},1,1,1,1,1,null,null,1,1,1,1,1,null,null,1,1,1,1,1,null,1,1,1,null,18,"　",1]
[6,"01-0000006",null,null,"おお　おおお",1,1,1,1,1,{"$nulls":9},1,1,1,1,1,null,null,1,1,1,1,1,null,1,1,1,null,18,"　",1]
[7,"01-0000007",null,null,"かか　かか",1,1,1,1,1,null,null,1,1,1,1,1,{"$nulls":9},1,1,1,1,1,null,1,1,1,null,18,"　",1]
[8,"01-0000008",null,null,"きき　きき",{"$nulls":7},1,1,1,1,1,null,null,1,1,1,1,1,{"$nulls":12},10,"　",1]
[9,"01-0000009",null,null,"くく　くく",1,1,1,1,1,null,null,1,1,1,1,1,null,null,1,1,1,1,1,null,null,1,1,1,1,1,null,1,1,1,null,23,"　",1]
[10,"01-0000010",null,null,"けけけけ",{"$nulls":15},1,1,1,{"$nulls":13},3,"　",1]
[11,"01-0000011",null,null,"ここ　ここ",{"$nulls":11},1,{"$nulls":19},1,"　",1]
[12,"01-0000012",null,null,"さささ　ささ",{"$nulls":14},1,1,1,1,1,{"$nulls":12},5,"　",1]
[13,"01-0000013",null,null,"しし　ししし",{"$nulls":18},2,null,null,1,1,1,1,1,{"$nulls":5},7,"　",1]
[14,"01-0000014",null,null,"すすす　すす",{"$nulls":14},1,1,1,1,1,{"$nulls":12},5,"　",1]
[15,"01-0000015",null,null,"せせ　せせ",{"$nulls":7},1,1,1,1,1,{"$nulls":6},1,{"$nulls":12},6,"　",1]
[16,"01-0000016",null,null,"そ　そそそそ",1,1,1,1,1,{"$nulls":9},1,1,1,1,1,{"$nulls":12},10,"○",1]
[17,"01-0000017",null,null,"たた　たたた",{"$nulls":18},1,{"$nulls":12},1,"　",1]
[18,"01-0000018",null,null,"ちちち　ちち",{"$nulls":7},1,1,1,1,1,{"$nulls":6},1,{"$nulls":12},6,"　",1]
[19,"01-0000019",null,null,"つつつつつ",{"$nulls":14},1,{"$nulls":3},1,{"$nulls":12},2,"　",1]
[20,{"$nulls":35},0,"　",0]
["総合計",{"$nulls":35},{"$f":"SUM(AK25:AK44)","v":205},{"$f":"COUNTIF(AL25:AL44,\"○\")","v":2},{"$f":"SUM(AM25:AM44)","v":19}]
{"$rows_empty":22}
[{"$nulls":37},"CCUS"]

{"sheet":"2事務受託様式４号","index":3,"n_rows":68,"n_cols":41,"rows_kept":68,"merged":[[1,0,1,36],[2,23,2,26],[2,27,2,36],[3,1,3,15],[3,23,3,26],[3,27,3,36],[5,1,5,2],[5,4,5,25],[5,28,5,36],[6,1,6,2],[6,4,6,25],[6,28,7,29],[6,30,7,36],[7,1,7,2],[7,4,7,25],[8,1,8,2],[8,4,8,25],[8,28,10,29],[8,30,10,36],[9,1,9,2],[9,4,10,25],[10,1,10,2],[11,1,11,2],[11,4,12,25],[12,1,12,2],[13,1,13,2],[13,4,13,25],[13,28,13,36],[14,1,14,2],[14,4,15,25],[14,28,16,36],[15,1,15,2],[16,1,16,2],[16,4,16,25],[18,1,18,2],[18,4,18,14],[18,15,18,21],[18,23,18,36],[19,1,19,2],[19,4,19,14],[19,15,19,21],[19,23,19,36],[21,8,21,11],[21,12,21,14],[21,15,21,21],[21,23,21,32],[22,0,23,0],[22,1,23,2],[22,3,23,3],[22,4,23,9],[22,10,23,15],[22,16,23,32],[22,33,22,36],[22,37,23,39],[23,33,23,36],[24,1,24,2],[24,4,24,9],[24,10,24,15],[24,16,24,32],[24,33,24,36],[24,37,24,39],[25,1,25,2],[25,4,25,9],[25,10,25,15],[25,16,25,32],[25,33,25,36],[25,37,25,39],[26,1,26,2],[26,4,26,9],[26,10,26,15],[26,16,26,32],[26,33,26,36],[26,37,26,39],[27,1,27,2],[27,4,27,9],[27,10,27,15],[27,16,27,32],[27,33,27,36],[27,37,27,39],[28,1,28,2],[28,4,28,9],[28,10,28,15],[28,16,28,32],[28,33,28,36],[28,37,28,39],[29,1,29,2],[29,4,29,9],[29,10,29,15],[29,16,29,32],[29,33,29,36],[29,37,29,39],[30,1,30,2],[30,4,30,9],[30,10,30,15],[30,16,30,32],[30,33,30,36],[30,37,30,39],[31,1,31,2],[31,4,31,9],[31,10,31,15],[31,16,31,32],[31,33,31,36],[31,37,31,39],[32,1,32,2],[32,4,32,9],[32,10,32,15],[32,16,32,32],[32,33,32,36],[32,37,32,39],[33,1,33,2],[33,4,33,9],[33,10,33,15],[33,16,33,32],[33,33,33,36],[33,37,33,39],[34,1,34,2],[34,4,34,9],[34,10,34,15],[34,16,34,32],[34,33,34,36],[34,37,34,39],[35,1,35,2],[35,4,35,9],[35,10,35,15],[35,16,35,32],[35,33,35,36],[35,37,35,39],[36,1,36,2],[36,4,36,9],[36,10,36,15],[36,16,36,32],[36,33,36,36],[36,37,36,39],[37,1,37,2],[37,4,37,9],[37,10,37,15],[37,16,37,32],[37,33,37,36],[37,37,37,39],[38,1,38,2],[38,4,38,9],[38,10,38,15],[38,16,38,32],[38,33,38,36],[38,37,38,39],[39,1,39,2],[39,4,39,9],[39,10,39,15],[39,16,39,32],[39,33,39,36],[39,37,39,39],[40,1,40,2],[40,4,40,9],[40,10,40,15],[40,16,40,32],[40,33,40,36],[40,37,40,39],[41,1,41,2],[41,4,41,9],[41,10,41,15],[41,16,41,32],[41,33,41,36],[41,37,41,39],[42,1,42,2],[42,4,42,9],[42,10,42,15],[42,16,42,32],[42,33,42,36],[42,37,42,39],[43,1,43,2],[43,4,43,9],[43,10,43,15],[43,16,43,32],[43,33,43,36],[43,37,43,39],[44,0,44,32],[44,33,44,36],[44,37,44,39],[67,37,68,39],[69,37,69,39],[70,37,70,39],[71,37,71,39],[72,37,72,39],[73,37,73,39],[74,37,74,39],[75,37,75,39],[76,37,76,39],[77,37,77,39],[78,37,78,39],[79,37,79,39],[80,37,80,39],[81,37,81,39],[82,37,82,39],[83,37,83,39],[84,37,84,39],[85,37,85,39]]}
["　　　建退共事務受託様式４号"]
["被共済者就労状況報告書（月別報告様式）"]
[{"$nulls":23},"整理番号",{"$nulls":3},{"$f":"IF('1事務受託様式５号'!AB3=0,\"\",'1事務受託様式５号'!AB3)","v":""}]
[null,{"$f":"IF('1事務受託様式５号'!B4=0,\"\",'1事務受託様式５号'!B4&\"　　殿\")","v":"株式会社　泰進建設　　殿"},{"$nulls":21},"報告日",{"$nulls":3},{"$f":"IF('1事務受託様式５号'!AB4=0,\"\",'1事務受託様式５号'!AB4)","v":"2022-05-05"}]
[]
[null,"報告事業所名",null,null,{"$f":"IF('1事務受託様式５号'!E6=0,\"\",'1事務受託様式５号'!E6)","v":"ＫＫ建設　株式会社"}]
[null,"住所",null,null,{"$f":"IF('1事務受託様式５号'!E7=0,\"\",'1事務受託様式５号'!E7)","v":"〒111-9999　滝川市　GG町１丁目"},{"$nulls":23},{"$f":"'1事務受託様式５号'!AC7:AD8","v":"　"},null,"掛金納付についての\n事務を委託します。"]
[null,"電話番号",null,null,{"$f":"IF('1事務受託様式５号'!E8=0,\"\",'1事務受託様式５号'!E8)","v":"0125-55-6666"}]
[null,"共済契約者\n番号",null,null,{"$f":"IF('1事務受託様式５号'!E9=0,\"\",'1事務受託様式５号'!E9)","v":"22-33333"},{"$nulls":23},{"$f":"'1事務受託様式５号'!AC9:AD11","v":"　"},null,"就労実績の集計に建設\nキャリアアップシステムを\n活用しています。"]
[null,"建設キャリアアップシステム",null,null,{"$f":"IF('1事務受託様式５号'!E10=0,\"\",'1事務受託様式５号'!E10)","v":1122334455}]
[null,"事業者ⅠD"]
[null,"工事番号および",null,null,{"$f":"IF('1事務受託様式５号'!E12=0,\"\",'1事務受託様式５号'!E12)","v":"１２３４　　経営体　ＫＫ地区　８８工区　工事"}]
[null,"工事名"]
[null,"工事コード",null,null,{"$f":"IF('1事務受託様式５号'!E14=0,\"\",'1事務受託様式５号'!E14)","v":""},{"$nulls":23},"現場責任者確認"]
[null,"建設キャリアアップシステム",null,null,{"$f":"IF('1事務受託様式５号'!E15=0,\"\",'1事務受託様式５号'!E15)","v":6677889900}]
[null,"現場ⅠD"]
[null,"備考",null,null,{"$f":"IF('1事務受託様式５号'!E17=0,\"\",'1事務受託様式５号'!E17)","v":""}]
[]
[null,"(共済契約者番号)",null,null,{"$f":"IF('1事務受託様式５号'!E19=0,\"\",'1事務受託様式５号'!E19)","v":"51-00200"},{"$nulls":10},"(共済契約者番号)",{"$nulls":7},{"$f":"IF('1事務受託様式５号'!X19=0,\"\",'1事務受託様式５号'!X19)","v":"22-33333"}]
[null,"元請事業所名",null,null,{"$f":"IF('1事務受託様式５号'!E20=0,\"\",'1事務受託様式５号'!E20)","v":"株式会社　泰進建設"},{"$nulls":10},"一次事業所名",{"$nulls":7},{"$f":"IF('1事務受託様式５号'!X20=0,\"\",'1事務受託様式５号'!X20)","v":"ＫＫ建設　株式会社"}]
[]
[null,"次の表のとおり、就労実績を報告します。",{"$nulls":6},"報告期間：",{"$nulls":6},{"$f":"IF('1事務受託様式５号'!Q23=0,\"\",'1事務受託様式５号'!Q23)","v":"2022-04-01"},{"$nulls":6},"～",{"$f":"IF('1事務受託様式５号'!Y23=0,\"\",'1事務受託様式５号'!Y23)","v":"2022-04-30"}]
["No.","共済契約者番号",null,"項番","共済契約者名",{"$nulls":5},"被共済者番号",{"$nulls":5},"被共済者名",{"$nulls":16},"就労日数",{"$nulls":3},"CCUS"]
[{"$nulls":33},"320円"]
[1,{"$f":"E9","v":"22-33333"},null,null,{"$f":"E6","v":"ＫＫ建設　株式会社"},{"$nulls":5},{"$f":"IF('1事務受託様式５号'!B25=0,\"\",'1事務受託様式５号'!B25)","v":"01-0000001"},{"$nulls":5},{"$f":"IF('1事務受託様式５号'!E25=0,\"\",'1事務受託様式５号'!E25)","v":"ああ　ああ"},{"$nulls":16},{"$f":"IF('1事務受託様式５号'!AK25=0,\"\",'1事務受託様式５号'!AK25)","v":23},{"$nulls":3},{"$f":"'1事務受託様式５号'!AL25","v":"○"},null,null,{"$f":"IF(Q25=\"\",0,1)","v":1}]
[2,{"$f":"E9","v":"22-33333"},null,null,{"$f":"E6","v":"ＫＫ建設　株式会社"},{"$nulls":5},{"$f":"IF('1事務受託様式５号'!B26=0,\"\",'1事務受託様式５号'!B26)","v":"01-0000002"},{"$nulls":5},{"$f":"IF('1事務受託様式５号'!E26=0,\"\",'1事務受託様式５号'!E26)","v":"ああ　あああ"},{"$nulls":16},{"$f":"IF('1事務受託様式５号'!AK26=0,\"\",'1事務受託様式５号'!AK26)","v":16},{"$nulls":3},{"$f":"'1事務受託様式５号'!AL26","v":"　"},null,null,{"$f":"IF(Q26=\"\",0,1)","v":1}]
[3,{"$f":"E9","v":"22-33333"},null,null,{"$f":"E6","v":"ＫＫ建設　株式会社"},{"$nulls":5},{"$f":"IF('1事務受託様式５号'!B27=0,\"\",'1事務受託様式５号'!B27)","v":"01-0000003"},{"$nulls":5},{"$f":"IF('1事務受託様式５号'!E27=0,\"\",'1事務受託様式５号'!E27)","v":"いい　いい"},{"$nulls":16},{"$f":"IF('1事務受託様式５号'!AK27=0,\"\",'1事務受託様式５号'!AK27)","v":18},{"$nulls":3},{"$f":"'1事務受託様式５号'!AL27","v":"　"},null,null,1]
[4,{"$f":"E9","v":"22-33333"},null,null,{"$f":"E6","v":"ＫＫ建設　株式会社"},{"$nulls":5},{"$f":"IF('1事務受託様式５号'!B28=0,\"\",'1事務受託様式５号'!B28)","v":"01-0000004"},{"$nulls":5},{"$f":"IF('1事務受託様式５号'!E28=0,\"\",'1事務受託様式５号'!E28)","v":"うう　ううう"},{"$nulls":16},{"$f":"IF('1事務受託様式５号'!AK28=0,\"\",'1事務受託様式５号'!AK28)","v":15},{"$nulls":3},{"$f":"'1事務受託様式５号'!AL28","v":"　"},null,null,1]
[5,{"$f":"E9","v":"22-33333"},null,null,{"$f":"E6","v":"ＫＫ建設　株式会社"},{"$nulls":5},{"$f":"IF('1事務受託様式５号'!B29=0,\"\",'1事務受託様式５号'!B29)","v":"01-0000005"},{"$nulls":5},{"$f":"IF('1事務受託様式５号'!E29=0,\"\",'1事務受託様式５号'!E29)","v":"ええ　えええ"},{"$nulls":16},{"$f":"IF('1事務受託様式５号'!AK29=0,\"\",'1事務受託様式５号'!AK29)","v":18},{"$nulls":3},{"$f":"'1事務受託様式５号'!AL29","v":"　"},null,null,1]
[6,{"$f":"E9","v":"22-33333"},null,null,{"$f":"E6","v":"ＫＫ建設　株式会社"},{"$nulls":5},{"$f":"IF('1事務受託様式５号'!B30=0,\"\",'1事務受託様式５号'!B30)","v":"01-0000006"},{"$nulls":5},{"$f":"IF('1事務受託様式５号'!E30=0,\"\",'1事務受託様式５号'!E30)","v":"おお　おおお"},{"$nulls":16},{"$f":"IF('1事務受託様式５号'!AK30=0,\"\",'1事務受託様式５号'!AK30)","v":18},{"$nulls":3},{"$f":"'1事務受託様式５号'!AL30","v":"　"},null,null,{"$f":"IF(Q30=\"\",0,1)","v":1}]
[7,{"$f":"E9","v":"22-33333"},null,null,{"$f":"E6","v":"ＫＫ建設　株式会社"},{"$nulls":5},{"$f":"IF('1事務受託様式５号'!B31=0,\"\",'1事務受託様式５号'!B31)","v":"01-0000007"},{"$nulls":5},{"$f":"IF('1事務受託様式５号'!E31=0,\"\",'1事務受託様式５号'!E31)","v":"かか　かか"},{"$nulls":16},{"$f":"IF('1事務受託様式５号'!AK31=0,\"\",'1事務受託様式５号'!AK31)","v":18},{"$nulls":3},{"$f":"'1事務受託様式５号'!AL31","v":"　"},null,null,1]
[8,{"$f":"E9","v":"22-33333"},null,null,{"$f":"E6","v":"ＫＫ建設　株式会社"},{"$nulls":5},{"$f":"IF('1事務受託様式５号'!B32=0,\"\",'1事務受託様式５号'!B32)","v":"01-0000008"},{"$nulls":5},{"$f":"IF('1事務受託様式５号'!E32=0,\"\",'1事務受託様式５号'!E32)","v":"きき　きき"},{"$nulls":16},{"$f":"IF('1事務受託様式５号'!AK32=0,\"\",'1事務受託様式５号'!AK32)","v":10},{"$nulls":3},{"$f":"'1事務受託様式５号'!AL32","v":"　"},null,null,1]
[9,{"$f":"E9","v":"22-33333"},null,null,{"$f":"E6","v":"ＫＫ建設　株式会社"},{"$nulls":5},{"$f":"IF('1事務受託様式５号'!B33=0,\"\",'1事務受託様式５号'!B33)","v":"01-0000009"},{"$nulls":5},{"$f":"IF('1事務受託様式５号'!E33=0,\"\",'1事務受託様式５号'!E33)","v":"くく　くく"},{"$nulls":16},{"$f":"IF('1事務受託様式５号'!AK33=0,\"\",'1事務受託様式５号'!AK33)","v":23},{"$nulls":3},{"$f":"'1事務受託様式５号'!AL33","v":"　"},null,null,1]
[10,{"$f":"E9","v":"22-33333"},null,null,{"$f":"E6","v":"ＫＫ建設　株式会社"},{"$nulls":5},{"$f":"IF('1事務受託様式５号'!B34=0,\"\",'1事務受託様式５号'!B34)","v":"01-0000010"},{"$nulls":5},{"$f":"IF('1事務受託様式５号'!E34=0,\"\",'1事務受託様式５号'!E34)","v":"けけけけ"},{"$nulls":16},{"$f":"IF('1事務受託様式５号'!AK34=0,\"\",'1事務受託様式５号'!AK34)","v":3},{"$nulls":3},{"$f":"'1事務受託様式５号'!AL34","v":"　"},null,null,1]
[11,{"$f":"E9","v":"22-33333"},null,null,{"$f":"E6","v":"ＫＫ建設　株式会社"},{"$nulls":5},{"$f":"IF('1事務受託様式５号'!B35=0,\"\",'1事務受託様式５号'!B35)","v":"01-0000011"},{"$nulls":5},{"$f":"IF('1事務受託様式５号'!E35=0,\"\",'1事務受託様式５号'!E35)","v":"ここ　ここ"},{"$nulls":16},{"$f":"IF('1事務受託様式５号'!AK35=0,\"\",'1事務受託様式５号'!AK35)","v":1},{"$nulls":3},{"$f":"'1事務受託様式５号'!AL35","v":"　"},null,null,{"$f":"IF(Q35=\"\",0,1)","v":1}]
[12,{"$f":"E9","v":"22-33333"},null,null,{"$f":"E6","v":"ＫＫ建設　株式会社"},{"$nulls":5},{"$f":"IF('1事務受託様式５号'!B36=0,\"\",'1事務受託様式５号'!B36)","v":"01-0000012"},{"$nulls":5},{"$f":"IF('1事務受託様式５号'!E36=0,\"\",'1事務受託様式５号'!E36)","v":"さささ　ささ"},{"$nulls":16},{"$f":"IF('1事務受託様式５号'!AK36=0,\"\",'1事務受託様式５号'!AK36)","v":5},{"$nulls":3},{"$f":"'1事務受託様式５号'!AL36","v":"　"},null,null,1]
[13,{"$f":"E9","v":"22-33333"},null,null,{"$f":"E6","v":"ＫＫ建設　株式会社"},{"$nulls":5},{"$f":"IF('1事務受託様式５号'!B37=0,\"\",'1事務受託様式５号'!B37)","v":"01-0000013"},{"$nulls":5},{"$f":"IF('1事務受託様式５号'!E37=0,\"\",'1事務受託様式５号'!E37)","v":"しし　ししし"},{"$nulls":16},{"$f":"IF('1事務受託様式５号'!AK37=0,\"\",'1事務受託様式５号'!AK37)","v":7},{"$nulls":3},{"$f":"'1事務受託様式５号'!AL37","v":"　"},null,null,1]
[14,{"$f":"E9","v":"22-33333"},null,null,{"$f":"E6","v":"ＫＫ建設　株式会社"},{"$nulls":5},{"$f":"IF('1事務受託様式５号'!B38=0,\"\",'1事務受託様式５号'!B38)","v":"01-0000014"},{"$nulls":5},{"$f":"IF('1事務受託様式５号'!E38=0,\"\",'1事務受託様式５号'!E38)","v":"すすす　すす"},{"$nulls":16},{"$f":"IF('1事務受託様式５号'!AK38=0,\"\",'1事務受託様式５号'!AK38)","v":5},{"$nulls":3},{"$f":"'1事務受託様式５号'!AL38","v":"　"},null,null,1]
[15,{"$f":"E9","v":"22-33333"},null,null,{"$f":"E6","v":"ＫＫ建設　株式会社"},{"$nulls":5},{"$f":"IF('1事務受託様式５号'!B39=0,\"\",'1事務受託様式５号'!B39)","v":"01-0000015"},{"$nulls":5},{"$f":"IF('1事務受託様式５号'!E39=0,\"\",'1事務受託様式５号'!E39)","v":"せせ　せせ"},{"$nulls":16},{"$f":"IF('1事務受託様式５号'!AK39=0,\"\",'1事務受託様式５号'!AK39)","v":6},{"$nulls":3},{"$f":"'1事務受託様式５号'!AL39","v":"　"},null,null,1]
[16,{"$f":"E9","v":"22-33333"},null,null,{"$f":"E6","v":"ＫＫ建設　株式会社"},{"$nulls":5},{"$f":"IF('1事務受託様式５号'!B40=0,\"\",'1事務受託様式５号'!B40)","v":"01-0000016"},{"$nulls":5},{"$f":"IF('1事務受託様式５号'!E40=0,\"\",'1事務受託様式５号'!E40)","v":"そ　そそそそ"},{"$nulls":16},{"$f":"IF('1事務受託様式５号'!AK40=0,\"\",'1事務受託様式５号'!AK40)","v":10},{"$nulls":3},{"$f":"'1事務受託様式５号'!AL40","v":"○"},null,null,1]
[17,{"$f":"E9","v":"22-33333"},null,null,{"$f":"E6","v":"ＫＫ建設　株式会社"},{"$nulls":5},{"$f":"IF('1事務受託様式５号'!B41=0,\"\",'1事務受託様式５号'!B41)","v":"01-0000017"},{"$nulls":5},{"$f":"IF('1事務受託様式５号'!E41=0,\"\",'1事務受託様式５号'!E41)","v":"たた　たたた"},{"$nulls":16},{"$f":"IF('1事務受託様式５号'!AK41=0,\"\",'1事務受託様式５号'!AK41)","v":1},{"$nulls":3},{"$f":"'1事務受託様式５号'!AL41","v":"　"},null,null,1]
[18,{"$f":"E9","v":"22-33333"},null,null,{"$f":"E6","v":"ＫＫ建設　株式会社"},{"$nulls":5},{"$f":"IF('1事務受託様式５号'!B42=0,\"\",'1事務受託様式５号'!B42)","v":"01-0000018"},{"$nulls":5},{"$f":"IF('1事務受託様式５号'!E42=0,\"\",'1事務受託様式５号'!E42)","v":"ちちち　ちち"},{"$nulls":16},{"$f":"IF('1事務受託様式５号'!AK42=0,\"\",'1事務受託様式５号'!AK42)","v":6},{"$nulls":3},{"$f":"'1事務受託様式５号'!AL42","v":"　"},null,null,1]
[19,{"$f":"E9","v":"22-33333"},null,null,{"$f":"E6","v":"ＫＫ建設　株式会社"},{"$nulls":5},{"$f":"IF('1事務受託様式５号'!B43=0,\"\",'1事務受託様式５号'!B43)","v":"01-0000019"},{"$nulls":5},{"$f":"IF('1事務受託様式５号'!E43=0,\"\",'1事務受託様式５号'!E43)","v":"つつつつつ"},{"$nulls":16},{"$f":"IF('1事務受託様式５号'!AK43=0,\"\",'1事務受託様式５号'!AK43)","v":2},{"$nulls":3},{"$f":"'1事務受託様式５号'!AL43","v":"　"},null,null,1]
[20,{"$f":"E9","v":"22-33333"},null,null,{"$f":"E6","v":"ＫＫ建設　株式会社"},{"$nulls":5},{"$f":"IF('1事務受託様式５号'!B44=0,\"\",'1事務受託様式５号'!B44)","v":""},{"$nulls":5},{"$f":"IF('1事務受託様式５号'!E44=0,\"\",'1事務受託様式５号'!E44)","v":""},{"$nulls":16},{"$f":"IF('1事務受託様式５号'!AK44=0,\"\",'1事務受託様式５号'!AK44)","v":""},{"$nulls":3},{"$f":"'1事務受託様式５号'!AL44","v":"　"},null,null,0]
["総合計",{"$nulls":32},{"$f":"SUM(AH25:AK44)","v":205},{"$nulls":3},{"$f":"'1事務受託様式５号'!AL45","v":2},null,null,{"$f":"SUM(AO25:AO44)","v":19}]
{"$rows_empty":22}
[{"$nulls":37},"CCUS"]

{"sheet":"3共済契約者別一覧","index":4,"n_rows":37,"n_cols":32,"rows_kept":37,"merged":[[1,0,1,36],[2,23,2,26],[2,27,2,36],[3,1,3,20],[3,23,3,26],[3,27,3,36],[5,1,5,2],[5,4,5,25],[5,28,7,29],[5,30,7,35],[6,1,6,2],[6,4,6,25],[7,1,7,2],[7,4,7,25],[8,1,8,2],[8,4,8,25],[9,1,9,2],[9,4,10,25],[10,1,10,2],[10,28,10,36],[11,1,11,2],[11,4,11,25],[12,1,12,2],[12,4,12,25],[12,35,12,36],[14,1,14,2],[14,4,14,14],[14,15,14,21],[14,23,14,36],[15,1,15,2],[15,4,15,14],[15,15,15,21],[15,23,15,36],[17,8,17,11],[17,12,17,21],[17,24,17,33],[17,38,17,40],[18,0,19,0],[18,1,19,2],[18,3,19,3],[18,4,19,24],[18,25,19,30],[18,31,19,36],[20,1,20,2],[20,4,20,24],[20,25,20,30],[20,31,20,36],[21,1,21,2],[21,4,21,24],[21,25,21,30],[21,31,21,36],[22,1,22,2],[22,4,22,24],[22,25,22,30],[22,31,22,36],[23,1,23,2],[23,4,23,24],[23,25,23,30],[23,31,23,36],[24,1,24,2],[24,4,24,24],[24,25,24,30],[24,31,24,36],[25,1,25,2],[25,4,25,24],[25,25,25,30],[25,31,25,36],[26,1,26,2],[26,4,26,24],[26,25,26,30],[26,31,26,36],[27,1,27,2],[27,4,27,24],[27,25,27,30],[27,31,27,36],[28,1,28,2],[28,4,28,24],[28,25,28,30],[28,31,28,36],[29,1,29,2],[29,4,29,24],[29,25,29,30],[29,31,29,36],[30,1,30,2],[30,4,30,24],[30,25,30,30],[30,31,30,36],[31,1,31,2],[31,4,31,24],[31,25,31,30],[31,31,31,36],[32,1,32,2],[32,4,32,24],[32,25,32,30],[32,31,32,36],[33,1,33,2],[33,4,33,24],[33,25,33,30],[33,31,33,36],[34,1,34,2],[34,4,34,24],[34,25,34,30],[34,31,34,36],[35,1,35,2],[35,4,35,24],[35,25,35,30],[35,31,35,36],[36,0,36,24],[36,25,36,30],[36,31,36,36]]}
[]
["建退共制度に係る被共済者就労状況報告書（共済契約者別一覧）"]
[{"$nulls":23},"整理番号",{"$nulls":3},{"$f":"IF('1事務受託様式５号'!AB3=0,\"\",'1事務受託様式５号'!AB3)","v":""}]
[null,"",{"$nulls":21},"報告日",{"$nulls":3},{"$f":"IF('1事務受託様式５号'!AB4=0,\"\",'1事務受託様式５号'!AB4)","v":"2022-05-05"}]
[]
[null,"報告事業所名",null,null,{"$f":"IF('1事務受託様式５号'!E6=0,\"\",'1事務受託様式５号'!E6)","v":"ＫＫ建設　株式会社"},{"$nulls":23},"　",null,"下表の共済契約者\n（下請負人）から\n掛金納付についての\n事務を受託しました。"]
[null,"住所",null,null,{"$f":"IF('1事務受託様式５号'!E7=0,\"\",'1事務受託様式５号'!E7)","v":"〒111-9999　滝川市　GG町１丁目"}]
[null,"電話番号",null,null,{"$f":"IF('1事務受託様式５号'!E8=0,\"\",'1事務受託様式５号'!E8)","v":"0125-55-6666"}]
[null,"共済契約者\n番号",null,null,{"$f":"IF('1事務受託様式５号'!E9=0,\"\",'1事務受託様式５号'!E9)","v":"22-33333"}]
[null,"工事番号および",null,null,{"$f":"IF('1事務受託様式５号'!E12=0,\"\",'1事務受託様式５号'!E12)","v":"１２３４　　経営体　ＫＫ地区　８８工区　工事"}]
[null,"工事名",{"$nulls":26},"現場責任者確認"]
[null,"工事コード",null,null,{"$f":"IF('1事務受託様式５号'!E14=0,\"\",'1事務受託様式５号'!E14)","v":""}]
[null,"備考",null,null,{"$f":"IF('1事務受託様式５号'!E17=0,\"\",'1事務受託様式５号'!E17)","v":""}]
[]
[null,"(共済契約者番号)",null,null,{"$f":"IF('1事務受託様式５号'!E19=0,\"\",'1事務受託様式５号'!E19)","v":"51-00200"},{"$nulls":10},"(共済契約者番号)",{"$nulls":7},{"$f":"IF('1事務受託様式５号'!X19=0,\"\",'1事務受託様式５号'!X19)","v":"22-33333"}]
[null,"元請事業所名",null,null,{"$f":"IF('1事務受託様式５号'!E20=0,\"\",'1事務受託様式５号'!E20)","v":"株式会社　泰進建設"},{"$nulls":10},"一次事業所名",{"$nulls":7},{"$f":"IF('1事務受託様式５号'!X20=0,\"\",'1事務受託様式５号'!X20)","v":"ＫＫ建設　株式会社"}]
[]
[null,"次の表のとおり、就労実績を報告します。",{"$nulls":6},"報告期間：",{"$nulls":3},{"$f":"IF('1事務受託様式５号'!Q23=0,\"\",'1事務受託様式５号'!Q23)","v":"2022-04-01"},{"$nulls":9},"～",null,{"$f":"IF('1事務受託様式５号'!Y23=0,\"\",'1事務受託様式５号'!Y23)","v":"2022-04-30"}]
["No.","共済契約者番号",null,"項番","共済契約者名",{"$nulls":20},"被共済者数",{"$nulls":5},"延べ就労日数"]
[]
["1",{"$f":"IF('1事務受託様式５号'!E9=0,\"\",'1事務受託様式５号'!E9)","v":"22-33333"},null,null,{"$f":"IF('1事務受託様式５号'!E6=0,\"\",'1事務受託様式５号'!E6)","v":"ＫＫ建設　株式会社"},{"$nulls":20},{"$f":"'1事務受託様式５号'!AM45","v":19},{"$nulls":5},{"$f":"'1事務受託様式５号'!AK45","v":205}]
["2",{"$f":"IF('5様式５号（二次）'!E9=0,\"\",'5様式５号（二次）'!E9)","v":"00-55555"},null,null,{"$f":"IF('5様式５号（二次）'!E6=0,\"\",'5様式５号（二次）'!E6)","v":"ＤＤＤ建設　株式会社"},{"$nulls":20},{"$f":"'5様式５号（二次）'!AM45","v":20},{"$nulls":5},{"$f":"'5様式５号（二次）'!AK45","v":127}]
["3",{"$f":"IF('8様式５号（二次）'!E9=0,\"\",'8様式５号（二次）'!E9)","v":"77-01234"},null,null,{"$f":"IF('8様式５号（二次）'!E6=0,\"\",'8様式５号（二次）'!E6)","v":"株式会社　ＢＢＢ組"},{"$nulls":20},{"$f":"'8様式５号（二次）'!AM45","v":20},{"$nulls":5},{"$f":"'8様式５号（二次）'!AK45","v":167}]
["4"]
["5"]
["6"]
["7"]
["8"]
["9"]
["10"]
["11"]
["12"]
["13"]
["14"]
["15"]
["16"]
["総合計　",{"$nulls":24},{"$f":"SUM(Z21:AE36)","v":59},{"$nulls":5},{"$f":"SUM(AF21:AK36)","v":499}]

{"sheet":"4事務受託様式２号","index":5,"n_rows":61,"n_cols":26,"rows_kept":61,"merged":[[4,1,4,29],[5,1,5,29],[7,24,7,29],[8,21,8,29],[11,1,11,2],[12,1,12,5],[12,6,12,20],[15,7,15,10],[15,11,15,29],[16,7,16,10],[16,11,16,29],[17,7,17,10],[17,11,17,29],[18,7,18,10],[18,11,18,29],[19,7,19,10],[19,11,20,29],[20,7,20,10],[21,7,21,10],[21,11,22,29],[22,7,22,10],[23,7,23,10],[23,11,23,29],[24,7,24,10],[24,11,25,29],[25,7,25,10],[31,5,31,11],[31,14,31,20],[31,24,31,29],[33,6,33,8],[33,16,33,18],[39,1,39,29],[41,24,41,29],[44,1,44,5],[44,6,44,20],[46,13,47,17],[49,13,50,17],[55,22,55,28],[57,25,57,29],[58,25,60,29],[59,15,60,24]]}
[null,"建退共事務受託様式２号"]
[]
[]
[]
[null,"建退共制度に係る被共済者就労状況報告書"]
[null,"（兼建設業退職金共済証紙交付依頼書）"]
[]
[{"$nulls":21},"整理番号",null,null,{"$f":"IF('1事務受託様式５号'!AB3=0,\"\",'1事務受託様式５号'!AB3)","v":""}]
[{"$nulls":21},{"$f":"IF('1事務受託様式５号'!AB4=0,\"\",'1事務受託様式５号'!AB4)","v":"2022-05-05"}]
[]
[]
[]
[null,"交付元事業所",{"$nulls":4},{"$f":"IF('1事務受託様式５号'!B4=0,\"\",'1事務受託様式５号'!B4&\"　　殿\")","v":"株式会社　泰進建設　　殿"}]
[]
[]
[{"$nulls":7},"報告事業所",{"$nulls":3},{"$f":"IF('1事務受託様式５号'!E6=0,\"\",'1事務受託様式５号'!E6)","v":"ＫＫ建設　株式会社"}]
[{"$nulls":7},"住         所",{"$nulls":3},{"$f":"IF('1事務受託様式５号'!E7=0,\"\",'1事務受託様式５号'!E7)","v":"〒111-9999　滝川市　GG町１丁目"}]
[{"$nulls":7},"電 話 番 号",{"$nulls":3},{"$f":"IF('1事務受託様式５号'!E8=0,\"\",'1事務受託様式５号'!E8)","v":"0125-55-6666"}]
[{"$nulls":7},"共済契約者\n番　　　　号",{"$nulls":3},{"$f":"IF('1事務受託様式５号'!E9=0,\"\",'1事務受託様式５号'!E9)","v":"22-33333"}]
[{"$nulls":7},"建設キャリアアップシステム",{"$nulls":3},{"$f":"IF('1事務受託様式５号'!E10=0,\"\",'1事務受託様式５号'!E10)","v":1122334455}]
[{"$nulls":7},"事業者ⅠD"]
[{"$nulls":7},"工事番号および",{"$nulls":3},{"$f":"IF('1事務受託様式５号'!E12=0,\"\",'1事務受託様式５号'!E12)","v":"１２３４　　経営体　ＫＫ地区　８８工区　工事"}]
[{"$nulls":7},"工   事   名"]
[{"$nulls":7},"工 事 コード",{"$nulls":3},{"$f":"IF('1事務受託様式５号'!E14=0,\"\",'1事務受託様式５号'!E14)","v":""}]
[{"$nulls":7},"建設キャリアアップシステム",{"$nulls":3},{"$f":"IF('1事務受託様式５号'!E15=0,\"\",'1事務受託様式５号'!E15)","v":6677889900}]
[{"$nulls":7},"現 場 Ⅰ D"]
[]
[null,null,"以下のとおり報告します。"]
[]
[{"$nulls":12},"記"]
[]
[null,null,"期　間",null,null,{"$f":"IF('1事務受託様式５号'!Q23=0,\"\",'1事務受託様式５号'!Q23)","v":"2022-04-01"},{"$nulls":6},"～",null,{"$f":"IF('1事務受託様式５号'!Y23=0,\"\",'1事務受託様式５号'!Y23)","v":"2022-04-30"},{"$nulls":9},"現場責任者確認"]
[]
[null,null,"被共済者数",{"$nulls":3},{"$f":"'3共済契約者別一覧'!Z37","v":{"v":59,"d":"59 "}},null,null,"人",null,"延べ就労日数",{"$nulls":4},{"$f":"'3共済契約者別一覧'!AF37","v":{"v":499,"d":"499 "}},null,null,"日"]
[]
[]
[]
[]
[]
[null,"建 設 業 退 職 金 共 済 証 紙 受 領 書"]
[]
[{"$nulls":21},"整理番号",null,null,{"$f":"IF('1事務受託様式５号'!AB3=0,\"\",'1事務受託様式５号'!AB3)","v":""}]
[]
[]
[null,"交付元事業所",{"$nulls":4},{"$f":"IF('1事務受託様式５号'!B4=0,\"\",'1事務受託様式５号'!B4&\"　　殿\")","v":"株式会社　泰進建設　　殿"}]
[]
[{"$nulls":13},{"v":499,"d":"499 "}]
[{"$nulls":10},"１日券",{"$nulls":7},"枚"]
[]
[]
[{"$nulls":10},"１０日券",{"$nulls":7},"枚",{"$nulls":3},{"$f":"IF(AND(N47=\"\",N50=\"\"),\"\",IF(Q34=(N47+(N50*10)),\"\",\"請求に対する受領枚数エラー\"))","v":""}]
[]
[]
[null,null,"上記の共済証紙を受領いたしました。"]
[]
[{"$nulls":22},"2022-05-21"]
[]
[{"$nulls":25},"受領者確認"]
[]
[{"$nulls":15},"Ａ建設　株式会社"]
[{"$nulls":11},"報告事業所"]

{"sheet":"5様式５号（二次）","index":6,"n_rows":68,"n_cols":39,"rows_kept":68,"merged":[[1,0,1,36],[2,23,2,26],[2,27,2,36],[3,1,3,6],[3,7,3,9],[3,23,3,26],[3,27,3,36],[5,1,5,2],[5,4,5,25],[5,28,5,36],[6,1,6,2],[6,4,6,25],[6,28,7,29],[6,30,7,36],[7,1,7,2],[7,4,7,25],[8,1,8,2],[8,4,8,25],[8,28,10,29],[8,30,10,36],[9,1,9,2],[9,4,10,25],[10,1,10,2],[11,1,11,2],[11,4,12,25],[12,1,12,2],[13,1,13,2],[13,4,13,25],[13,28,13,36],[14,1,14,2],[14,4,15,25],[14,28,16,36],[15,1,15,2],[16,1,16,2],[16,4,16,25],[18,1,18,2],[18,4,18,14],[18,16,18,21],[18,23,18,36],[19,1,19,2],[19,4,19,14],[19,16,19,21],[19,23,19,36],[21,1,21,11],[21,12,21,14],[21,15,21,21],[21,23,21,35],[22,0,23,0],[22,1,23,2],[22,3,23,3],[22,4,23,4],[22,10,22,14],[22,16,22,22],[22,24,22,33],[22,37,23,37],[24,1,24,2],[25,1,25,2],[26,1,26,2],[27,1,27,2],[28,1,28,2],[29,1,29,2],[30,1,30,2],[31,1,31,2],[32,1,32,2],[33,1,33,2],[34,1,34,2],[35,1,35,2],[36,1,36,2],[37,1,37,2],[38,1,38,2],[39,1,39,2],[40,1,40,2],[41,1,41,2],[42,1,42,2],[43,1,43,2],[44,0,44,35],[67,37,68,37]]}
["　　　建退共事務受託様式５号"]
["被共済者就労状況報告書（日別報告様式）"]
[{"$nulls":23},"整理番号",{"$nulls":3},{"$f":"IF('1事務受託様式５号'!AB3=0,\"\",'1事務受託様式５号'!AB3)","v":""}]
[null,{"$f":"IF('1事務受託様式５号'!E6=0,\"\",'1事務受託様式５号'!E6)","v":"ＫＫ建設　株式会社"},{"$nulls":5},"殿",{"$nulls":15},"報告日",{"$nulls":3},"2022-05-01"]
[]
[null,"報告事業所名",null,null,"ＤＤＤ建設　株式会社"]
[null,"住所",null,null,"〒000-0000　滝川市２丁目３番地",{"$nulls":23},"　",null,"掛金納付についての\n事務を委託します。"]
[null,"電話番号",null,null,"0125-33-6789"]
[null,"共済契約者\n番号",null,null,"00-55555",{"$nulls":23},"　",null,"就労実績の集計に建設\nキャリアアップシステムを\n活用しています。"]
[null,"建設キャリアアップシステム",null,null,123456789]
[null,"事業者ⅠD"]
[null,"工事番号および",null,null,{"$f":"IF('1事務受託様式５号'!E12=0,\"\",'1事務受託様式５号'!E12)","v":"１２３４　　経営体　ＫＫ地区　８８工区　工事"}]
[null,"工事名"]
[null,"工事コード",null,null,{"$f":"IF('1事務受託様式５号'!E14=0,\"\",'1事務受託様式５号'!E14)","v":""},{"$nulls":23},"現場責任者確認"]
[null,"建設キャリアアップシステム",null,null,{"$f":"IF('1事務受託様式５号'!E15=0,\"\",'1事務受託様式５号'!E15)","v":6677889900}]
[null,"現場ⅠD"]
[null,"備考",null,null,{"$f":"IF('1事務受託様式５号'!E17=0,\"\",'1事務受託様式５号'!E17)","v":""}]
[]
[null,"(契約者番号)",null,null,{"$f":"IF('1事務受託様式５号'!E19=0,\"\",'1事務受託様式５号'!E19)","v":"51-00200"},{"$nulls":11},"(契約者番号)",{"$nulls":6},{"$f":"IF('1事務受託様式５号'!X19=0,\"\",'1事務受託様式５号'!X19)","v":"22-33333"}]
[null,"元請事業所名",null,null,{"$f":"IF('1事務受託様式５号'!E20=0,\"\",'1事務受託様式５号'!E20)","v":"株式会社　泰進建設"},{"$nulls":11},"一次事業所名",{"$nulls":6},{"$f":"IF('1事務受託様式５号'!X20=0,\"\",'1事務受託様式５号'!X20)","v":"ＫＫ建設　株式会社"}]
[]
[null,"次の表のとおり、就労実績を報告します。"]
["No.","被共済者番号",null,"項番","氏　名",{"$nulls":5},"就労状況",{"$nulls":5},{"$f":"IF('1事務受託様式５号'!Q23=0,\"\",'1事務受託様式５号'!Q23)","v":"2022-04-01"},{"$nulls":6},"～",{"$f":"IF('1事務受託様式５号'!Y23=0,\"\",'1事務受託様式５号'!Y23)","v":"2022-04-30"},{"$nulls":12},"CCUS"]
[{"$nulls":5},1,2,3,4,5,6,7,8,9,10,11,12,13,14,15,16,17,18,19,20,21,22,23,24,25,26,27,28,29,30,31,"就労日数"]
[1,"02-0000011",null,null,"ａ　ａ",1,1,1,1,1,null,null,1,1,1,1,1,null,null,1,1,1,1,1,null,null,1,1,1,1,1,null,null,1,1,null,{"$f":"SUM(F25:AJ25)","v":22},"　",{"$f":"IF(E25=\"\",0,1)","v":1}]
[2,"02-0000012",null,null,"BBB　BBB",{"$nulls":7},1,1,1,1,1,{"$nulls":9},1,1,1,1,1,{"$nulls":5},{"$f":"SUM(F26:AJ26)","v":10},"　",1]
[3,"02-0000013",null,null,"ＴＴＴ　ＴＴＴ",{"$nulls":21},1,1,1,1,1,{"$nulls":5},5,"○",1]
[4,"02-0000014",null,null,"ＡＡＡ　ＡＡＡ",{"$nulls":14},1,1,1,1,1,null,null,1,1,1,1,1,{"$nulls":5},10,"　",1]
[5,"02-0000015",null,null,"OO　OOOO",{"$nulls":7},1,1,1,1,1,null,null,1,1,1,1,1,{"$nulls":12},10,"　",1]
[6,"02-0000016",null,null,"CC　CCC",null,null,1,1,1,{"$nulls":26},3,"　",1]
[7,"02-0000017",null,null,"DD　DDDD",{"$nulls":21},1,1,1,1,{"$nulls":6},4,"　",1]
[8,"02-0000018",null,null,"EE　EEEEE",{"$nulls":14},1,1,1,1,{"$nulls":13},4,"　",1]
[9,"02-0000019",null,null,"FFFF　FFF",{"$nulls":9},1,1,1,null,null,1,1,1,1,{"$nulls":13},7,"　",1]
[10,"02-0000020",null,null,"ｇｇ　ｇｇｇｇ",{"$nulls":22},1,1,1,1,{"$nulls":5},4,"○",1]
[11,"02-0000021",null,null,"HHH　HHH",1,1,1,1,1,null,null,1,1,1,{"$nulls":21},8,"　",1]
[12,"02-0000022",null,null,"SSS　SSS",{"$nulls":21},1,1,1,1,1,null,null,1,null,null,6,"　",1]
[13,"02-0000023",null,null,"WWW　WW",{"$nulls":21},1,1,1,1,1,{"$nulls":5},5,"　",1]
[14,"02-0000024",null,null,"RR　RRR",{"$nulls":6},1,1,{"$nulls":23},2,"　",1]
[15,"02-0000025",null,null,"YY　YYYY",{"$nulls":14},1,1,1,1,1,{"$nulls":12},5,"　",1]
[16,"02-0000026",null,null,"おお　おおお",null,null,1,1,1,{"$nulls":26},3,"　",1]
[17,"02-0000027",null,null,"PPPPPP",{"$nulls":21},1,1,1,1,1,null,null,1,null,null,6,"　",1]
[18,"02-0000028",null,null,"うう　ううう",{"$nulls":8},1,1,1,{"$nulls":18},1,null,4,"　",1]
[19,"02-0000029",null,null,"ええ　えええ",{"$nulls":8},1,1,1,{"$nulls":10},1,1,1,{"$nulls":7},6,"　",1]
[20,"02-0000030",null,null,"ＫＫ　ＫＫＫ",{"$nulls":16},1,1,1,{"$nulls":12},3,"　",1]
["総合計",{"$nulls":35},{"$f":"SUM(AK25:AK44)","v":127},{"$f":"COUNTIF(AL25:AL44,\"○\")","v":2},{"$f":"SUM(AM25:AM44)","v":20}]
{"$rows_empty":22}
[{"$nulls":37},"CCUS"]

{"sheet":"6様式４号（二次）","index":7,"n_rows":68,"n_cols":39,"rows_kept":68,"merged":[[1,0,1,36],[2,23,2,26],[2,27,2,36],[3,1,3,15],[3,23,3,26],[3,27,3,36],[5,1,5,2],[5,4,5,25],[5,28,5,36],[6,1,6,2],[6,4,6,25],[6,28,7,29],[6,30,7,36],[7,1,7,2],[7,4,7,25],[8,1,8,2],[8,4,8,25],[8,28,10,29],[8,30,10,36],[9,1,9,2],[9,4,10,25],[10,1,10,2],[11,1,11,2],[11,4,12,25],[12,1,12,2],[13,1,13,2],[13,4,13,25],[13,28,13,36],[14,1,14,2],[14,4,15,25],[14,28,16,36],[15,1,15,2],[16,1,16,2],[16,4,16,25],[18,1,18,2],[18,4,18,14],[18,15,18,21],[18,23,18,36],[19,1,19,2],[19,4,19,14],[19,15,19,21],[19,23,19,36],[21,8,21,11],[21,12,21,14],[21,15,21,21],[21,23,21,32],[22,0,23,0],[22,1,23,2],[22,3,23,3],[22,4,23,9],[22,10,23,15],[22,16,23,32],[22,33,22,36],[22,37,23,37],[23,33,23,36],[24,1,24,2],[24,4,24,9],[24,10,24,15],[24,16,24,32],[24,33,24,36],[25,1,25,2],[25,4,25,9],[25,10,25,15],[25,16,25,32],[25,33,25,36],[26,1,26,2],[26,4,26,9],[26,10,26,15],[26,16,26,32],[26,33,26,36],[27,1,27,2],[27,4,27,9],[27,10,27,15],[27,16,27,32],[27,33,27,36],[28,1,28,2],[28,4,28,9],[28,10,28,15],[28,16,28,32],[28,33,28,36],[29,1,29,2],[29,4,29,9],[29,10,29,15],[29,16,29,32],[29,33,29,36],[30,1,30,2],[30,4,30,9],[30,10,30,15],[30,16,30,32],[30,33,30,36],[31,1,31,2],[31,4,31,9],[31,10,31,15],[31,16,31,32],[31,33,31,36],[32,1,32,2],[32,4,32,9],[32,10,32,15],[32,16,32,32],[32,33,32,36],[33,1,33,2],[33,4,33,9],[33,10,33,15],[33,16,33,32],[33,33,33,36],[34,1,34,2],[34,4,34,9],[34,10,34,15],[34,16,34,32],[34,33,34,36],[35,1,35,2],[35,4,35,9],[35,10,35,15],[35,16,35,32],[35,33,35,36],[36,1,36,2],[36,4,36,9],[36,10,36,15],[36,16,36,32],[36,33,36,36],[37,1,37,2],[37,4,37,9],[37,10,37,15],[37,16,37,32],[37,33,37,36],[38,1,38,2],[38,4,38,9],[38,10,38,15],[38,16,38,32],[38,33,38,36],[39,1,39,2],[39,4,39,9],[39,10,39,15],[39,16,39,32],[39,33,39,36],[40,1,40,2],[40,4,40,9],[40,10,40,15],[40,16,40,32],[40,33,40,36],[41,1,41,2],[41,4,41,9],[41,10,41,15],[41,16,41,32],[41,33,41,36],[42,1,42,2],[42,4,42,9],[42,10,42,15],[42,16,42,32],[42,33,42,36],[43,1,43,2],[43,4,43,9],[43,10,43,15],[43,16,43,32],[43,33,43,36],[44,0,44,32],[44,33,44,36],[67,37,68,37]]}
["　　　建退共事務受託様式４号"]
["被共済者就労状況報告書（月別報告様式）"]
[{"$nulls":23},"整理番号",{"$nulls":3},{"$f":"IF('5様式５号（二次）'!AB3=0,\"\",'5様式５号（二次）'!AB3)","v":""}]
[null,{"$f":"IF('5様式５号（二次）'!B4=0,\"\",'5様式５号（二次）'!B4&\"　　殿\")","v":"ＫＫ建設　株式会社　　殿"},{"$nulls":21},"報告日",{"$nulls":3},{"$f":"IF('5様式５号（二次）'!AB4=0,\"\",'5様式５号（二次）'!AB4)","v":"2022-05-01"}]
[]
[null,"報告事業所名",null,null,{"$f":"IF('5様式５号（二次）'!E6=0,\"\",'5様式５号（二次）'!E6)","v":"ＤＤＤ建設　株式会社"}]
[null,"住所",null,null,{"$f":"IF('5様式５号（二次）'!E7=0,\"\",'5様式５号（二次）'!E7)","v":"〒000-0000　滝川市２丁目３番地"},{"$nulls":23},"　",null,"掛金納付についての\n事務を委託します。"]
[null,"電話番号",null,null,{"$f":"IF('5様式５号（二次）'!E8=0,\"\",'5様式５号（二次）'!E8)","v":"0125-33-6789"}]
[null,"共済契約者\n番号",null,null,{"$f":"IF('5様式５号（二次）'!E9=0,\"\",'5様式５号（二次）'!E9)","v":"00-55555"},{"$nulls":23},"　",null,"就労実績の集計に建設\nキャリアアップシステムを\n活用しています。"]
[null,"建設キャリアアップシステム",null,null,{"$f":"IF('5様式５号（二次）'!E10=0,\"\",'5様式５号（二次）'!E10)","v":123456789}]
[null,"事業者ⅠD"]
[null,"工事番号および",null,null,{"$f":"IF('5様式５号（二次）'!E12=0,\"\",'5様式５号（二次）'!E12)","v":"１２３４　　経営体　ＫＫ地区　８８工区　工事"}]
[null,"工事名"]
[null,"工事コード",null,null,{"$f":"IF('5様式５号（二次）'!E14=0,\"\",'5様式５号（二次）'!E14)","v":""},{"$nulls":23},"現場責任者確認"]
[null,"建設キャリアアップシステム",null,null,{"$f":"IF('5様式５号（二次）'!E15=0,\"\",'5様式５号（二次）'!E15)","v":6677889900}]
[null,"現場ⅠD"]
[null,"備考",null,null,{"$f":"IF('5様式５号（二次）'!E17=0,\"\",'5様式５号（二次）'!E17)","v":""}]
[]
[null,"(共済契約者番号)",null,null,{"$f":"IF('1事務受託様式５号'!E19=0,\"\",'1事務受託様式５号'!E19)","v":"51-00200"},{"$nulls":10},"(共済契約者番号)",{"$nulls":7},{"$f":"IF('1事務受託様式５号'!X19=0,\"\",'1事務受託様式５号'!X19)","v":"22-33333"}]
[null,"元請事業所名",null,null,{"$f":"IF('1事務受託様式５号'!E20=0,\"\",'1事務受託様式５号'!E20)","v":"株式会社　泰進建設"},{"$nulls":10},"一次事業所名",{"$nulls":7},{"$f":"IF('1事務受託様式５号'!X20=0,\"\",'1事務受託様式５号'!X20)","v":"ＫＫ建設　株式会社"}]
[]
[null,"次の表のとおり、就労実績を報告します。",{"$nulls":6},"報告期間：",{"$nulls":6},{"$f":"IF('5様式５号（二次）'!Q23=0,\"\",'5様式５号（二次）'!Q23)","v":"2022-04-01"},{"$nulls":6},"～",{"$f":"IF('5様式５号（二次）'!Y23=0,\"\",'5様式５号（二次）'!Y23)","v":"2022-04-30"}]
["No.","共済契約者番号",null,"項番","共済契約者名",{"$nulls":5},"被共済者番号",{"$nulls":5},"被共済者名",{"$nulls":16},"就労日数",{"$nulls":3},"CCUS"]
[{"$nulls":33},"320円"]
[1,{"$f":"E9","v":"00-55555"},null,null,{"$f":"E6","v":"ＤＤＤ建設　株式会社"},{"$nulls":5},{"$f":"IF('5様式５号（二次）'!B25=0,\"\",'5様式５号（二次）'!B25)","v":"02-0000011"},{"$nulls":5},{"$f":"IF('5様式５号（二次）'!E25=0,\"\",'5様式５号（二次）'!E25)","v":"ａ　ａ"},{"$nulls":16},{"$f":"IF('5様式５号（二次）'!AK25=0,\"\",'5様式５号（二次）'!AK25)","v":22},{"$nulls":3},"　",{"$f":"IF(Q25=\"\",0,1)","v":1}]
[2,{"$f":"E9","v":"00-55555"},null,null,{"$f":"E6","v":"ＤＤＤ建設　株式会社"},{"$nulls":5},{"$f":"IF('5様式５号（二次）'!B26=0,\"\",'5様式５号（二次）'!B26)","v":"02-0000012"},{"$nulls":5},{"$f":"IF('5様式５号（二次）'!E26=0,\"\",'5様式５号（二次）'!E26)","v":"BBB　BBB"},{"$nulls":16},{"$f":"IF('5様式５号（二次）'!AK26=0,\"\",'5様式５号（二次）'!AK26)","v":10},{"$nulls":3},"　",{"$f":"IF(Q26=\"\",0,1)","v":1}]
[3,{"$f":"E9","v":"00-55555"},null,null,{"$f":"E6","v":"ＤＤＤ建設　株式会社"},{"$nulls":5},{"$f":"IF('5様式５号（二次）'!B27=0,\"\",'5様式５号（二次）'!B27)","v":"02-0000013"},{"$nulls":5},{"$f":"IF('5様式５号（二次）'!E27=0,\"\",'5様式５号（二次）'!E27)","v":"ＴＴＴ　ＴＴＴ"},{"$nulls":16},{"$f":"IF('5様式５号（二次）'!AK27=0,\"\",'5様式５号（二次）'!AK27)","v":5},{"$nulls":3},"○",1]
[4,{"$f":"E9","v":"00-55555"},null,null,{"$f":"E6","v":"ＤＤＤ建設　株式会社"},{"$nulls":5},{"$f":"IF('5様式５号（二次）'!B28=0,\"\",'5様式５号（二次）'!B28)","v":"02-0000014"},{"$nulls":5},{"$f":"IF('5様式５号（二次）'!E28=0,\"\",'5様式５号（二次）'!E28)","v":"ＡＡＡ　ＡＡＡ"},{"$nulls":16},{"$f":"IF('5様式５号（二次）'!AK28=0,\"\",'5様式５号（二次）'!AK28)","v":10},{"$nulls":3},"　",1]
[5,{"$f":"E9","v":"00-55555"},null,null,{"$f":"E6","v":"ＤＤＤ建設　株式会社"},{"$nulls":5},{"$f":"IF('5様式５号（二次）'!B29=0,\"\",'5様式５号（二次）'!B29)","v":"02-0000015"},{"$nulls":5},{"$f":"IF('5様式５号（二次）'!E29=0,\"\",'5様式５号（二次）'!E29)","v":"OO　OOOO"},{"$nulls":16},{"$f":"IF('5様式５号（二次）'!AK29=0,\"\",'5様式５号（二次）'!AK29)","v":10},{"$nulls":3},"　",1]
[6,{"$f":"E9","v":"00-55555"},null,null,{"$f":"E6","v":"ＤＤＤ建設　株式会社"},{"$nulls":5},{"$f":"IF('5様式５号（二次）'!B30=0,\"\",'5様式５号（二次）'!B30)","v":"02-0000016"},{"$nulls":5},{"$f":"IF('5様式５号（二次）'!E30=0,\"\",'5様式５号（二次）'!E30)","v":"CC　CCC"},{"$nulls":16},{"$f":"IF('5様式５号（二次）'!AK30=0,\"\",'5様式５号（二次）'!AK30)","v":3},{"$nulls":3},"　",1]
[7,{"$f":"E9","v":"00-55555"},null,null,{"$f":"E6","v":"ＤＤＤ建設　株式会社"},{"$nulls":5},{"$f":"IF('5様式５号（二次）'!B31=0,\"\",'5様式５号（二次）'!B31)","v":"02-0000017"},{"$nulls":5},{"$f":"IF('5様式５号（二次）'!E31=0,\"\",'5様式５号（二次）'!E31)","v":"DD　DDDD"},{"$nulls":16},{"$f":"IF('5様式５号（二次）'!AK31=0,\"\",'5様式５号（二次）'!AK31)","v":4},{"$nulls":3},"　",1]
[8,{"$f":"E9","v":"00-55555"},null,null,{"$f":"E6","v":"ＤＤＤ建設　株式会社"},{"$nulls":5},{"$f":"IF('5様式５号（二次）'!B32=0,\"\",'5様式５号（二次）'!B32)","v":"02-0000018"},{"$nulls":5},{"$f":"IF('5様式５号（二次）'!E32=0,\"\",'5様式５号（二次）'!E32)","v":"EE　EEEEE"},{"$nulls":16},{"$f":"IF('5様式５号（二次）'!AK32=0,\"\",'5様式５号（二次）'!AK32)","v":4},{"$nulls":3},"　",1]
[9,{"$f":"E9","v":"00-55555"},null,null,{"$f":"E6","v":"ＤＤＤ建設　株式会社"},{"$nulls":5},{"$f":"IF('5様式５号（二次）'!B33=0,\"\",'5様式５号（二次）'!B33)","v":"02-0000019"},{"$nulls":5},{"$f":"IF('5様式５号（二次）'!E33=0,\"\",'5様式５号（二次）'!E33)","v":"FFFF　FFF"},{"$nulls":16},{"$f":"IF('5様式５号（二次）'!AK33=0,\"\",'5様式５号（二次）'!AK33)","v":7},{"$nulls":3},"　",1]
[10,{"$f":"E9","v":"00-55555"},null,null,{"$f":"E6","v":"ＤＤＤ建設　株式会社"},{"$nulls":5},{"$f":"IF('5様式５号（二次）'!B34=0,\"\",'5様式５号（二次）'!B34)","v":"02-0000020"},{"$nulls":5},{"$f":"IF('5様式５号（二次）'!E34=0,\"\",'5様式５号（二次）'!E34)","v":"ｇｇ　ｇｇｇｇ"},{"$nulls":16},{"$f":"IF('5様式５号（二次）'!AK34=0,\"\",'5様式５号（二次）'!AK34)","v":4},{"$nulls":3},"○",1]
[11,{"$f":"E9","v":"00-55555"},null,null,{"$f":"E6","v":"ＤＤＤ建設　株式会社"},{"$nulls":5},{"$f":"IF('5様式５号（二次）'!B35=0,\"\",'5様式５号（二次）'!B35)","v":"02-0000021"},{"$nulls":5},{"$f":"IF('5様式５号（二次）'!E35=0,\"\",'5様式５号（二次）'!E35)","v":"HHH　HHH"},{"$nulls":16},{"$f":"IF('5様式５号（二次）'!AK35=0,\"\",'5様式５号（二次）'!AK35)","v":8},{"$nulls":3},"　",1]
[12,{"$f":"E9","v":"00-55555"},null,null,{"$f":"E6","v":"ＤＤＤ建設　株式会社"},{"$nulls":5},{"$f":"IF('5様式５号（二次）'!B36=0,\"\",'5様式５号（二次）'!B36)","v":"02-0000022"},{"$nulls":5},{"$f":"IF('5様式５号（二次）'!E36=0,\"\",'5様式５号（二次）'!E36)","v":"SSS　SSS"},{"$nulls":16},{"$f":"IF('5様式５号（二次）'!AK36=0,\"\",'5様式５号（二次）'!AK36)","v":6},{"$nulls":3},"　",1]
[13,{"$f":"E9","v":"00-55555"},null,null,{"$f":"E6","v":"ＤＤＤ建設　株式会社"},{"$nulls":5},{"$f":"IF('5様式５号（二次）'!B37=0,\"\",'5様式５号（二次）'!B37)","v":"02-0000023"},{"$nulls":5},{"$f":"IF('5様式５号（二次）'!E37=0,\"\",'5様式５号（二次）'!E37)","v":"WWW　WW"},{"$nulls":16},{"$f":"IF('5様式５号（二次）'!AK37=0,\"\",'5様式５号（二次）'!AK37)","v":5},{"$nulls":3},"　",1]
[14,{"$f":"E9","v":"00-55555"},null,null,{"$f":"E6","v":"ＤＤＤ建設　株式会社"},{"$nulls":5},{"$f":"IF('5様式５号（二次）'!B38=0,\"\",'5様式５号（二次）'!B38)","v":"02-0000024"},{"$nulls":5},{"$f":"IF('5様式５号（二次）'!E38=0,\"\",'5様式５号（二次）'!E38)","v":"RR　RRR"},{"$nulls":16},{"$f":"IF('5様式５号（二次）'!AK38=0,\"\",'5様式５号（二次）'!AK38)","v":2},{"$nulls":3},"　",1]
[15,{"$f":"E9","v":"00-55555"},null,null,{"$f":"E6","v":"ＤＤＤ建設　株式会社"},{"$nulls":5},{"$f":"IF('5様式５号（二次）'!B39=0,\"\",'5様式５号（二次）'!B39)","v":"02-0000025"},{"$nulls":5},{"$f":"IF('5様式５号（二次）'!E39=0,\"\",'5様式５号（二次）'!E39)","v":"YY　YYYY"},{"$nulls":16},{"$f":"IF('5様式５号（二次）'!AK39=0,\"\",'5様式５号（二次）'!AK39)","v":5},{"$nulls":3},"　",1]
[16,{"$f":"E9","v":"00-55555"},null,null,{"$f":"E6","v":"ＤＤＤ建設　株式会社"},{"$nulls":5},{"$f":"IF('5様式５号（二次）'!B40=0,\"\",'5様式５号（二次）'!B40)","v":"02-0000026"},{"$nulls":5},{"$f":"IF('5様式５号（二次）'!E40=0,\"\",'5様式５号（二次）'!E40)","v":"おお　おおお"},{"$nulls":16},{"$f":"IF('5様式５号（二次）'!AK40=0,\"\",'5様式５号（二次）'!AK40)","v":3},{"$nulls":3},"　",1]
[17,{"$f":"E9","v":"00-55555"},null,null,{"$f":"E6","v":"ＤＤＤ建設　株式会社"},{"$nulls":5},{"$f":"IF('5様式５号（二次）'!B41=0,\"\",'5様式５号（二次）'!B41)","v":"02-0000027"},{"$nulls":5},{"$f":"IF('5様式５号（二次）'!E41=0,\"\",'5様式５号（二次）'!E41)","v":"PPPPPP"},{"$nulls":16},{"$f":"IF('5様式５号（二次）'!AK41=0,\"\",'5様式５号（二次）'!AK41)","v":6},{"$nulls":3},"　",1]
[18,{"$f":"E9","v":"00-55555"},null,null,{"$f":"E6","v":"ＤＤＤ建設　株式会社"},{"$nulls":5},{"$f":"IF('5様式５号（二次）'!B42=0,\"\",'5様式５号（二次）'!B42)","v":"02-0000028"},{"$nulls":5},{"$f":"IF('5様式５号（二次）'!E42=0,\"\",'5様式５号（二次）'!E42)","v":"うう　ううう"},{"$nulls":16},{"$f":"IF('5様式５号（二次）'!AK42=0,\"\",'5様式５号（二次）'!AK42)","v":4},{"$nulls":3},"　",1]
[19,{"$f":"E9","v":"00-55555"},null,null,{"$f":"E6","v":"ＤＤＤ建設　株式会社"},{"$nulls":5},{"$f":"IF('5様式５号（二次）'!B43=0,\"\",'5様式５号（二次）'!B43)","v":"02-0000029"},{"$nulls":5},{"$f":"IF('5様式５号（二次）'!E43=0,\"\",'5様式５号（二次）'!E43)","v":"ええ　えええ"},{"$nulls":16},{"$f":"IF('5様式５号（二次）'!AK43=0,\"\",'5様式５号（二次）'!AK43)","v":6},{"$nulls":3},"　",1]
[20,{"$f":"E9","v":"00-55555"},null,null,{"$f":"E6","v":"ＤＤＤ建設　株式会社"},{"$nulls":5},{"$f":"IF('5様式５号（二次）'!B44=0,\"\",'5様式５号（二次）'!B44)","v":"02-0000030"},{"$nulls":5},{"$f":"IF('5様式５号（二次）'!E44=0,\"\",'5様式５号（二次）'!E44)","v":"ＫＫ　ＫＫＫ"},{"$nulls":16},{"$f":"IF('5様式５号（二次）'!AK44=0,\"\",'5様式５号（二次）'!AK44)","v":3},{"$nulls":3},"　",1]
["総合計",{"$nulls":32},{"$f":"SUM(AH25:AK44)","v":127},{"$nulls":3},{"$f":"COUNTIF(AL25:AL44,\"○\")","v":2},{"$f":"SUM(AM25:AM44)","v":20}]
{"$rows_empty":22}
[{"$nulls":37},"CCUS"]

{"sheet":"7様式２号（二次）","index":8,"n_rows":61,"n_cols":26,"rows_kept":61,"merged":[[4,1,4,29],[5,1,5,29],[7,24,7,29],[8,21,8,29],[11,1,11,2],[12,1,12,5],[12,6,12,20],[15,7,15,10],[15,11,15,29],[16,7,16,10],[16,11,16,29],[17,7,17,10],[17,11,17,29],[18,7,18,10],[18,11,18,29],[19,7,19,10],[19,11,20,29],[20,7,20,10],[21,7,21,10],[21,11,22,29],[22,7,22,10],[23,7,23,10],[23,11,23,29],[24,7,24,10],[24,11,25,29],[25,7,25,10],[31,5,31,11],[31,14,31,20],[31,24,31,29],[33,6,33,8],[33,16,33,18],[39,1,39,29],[41,24,41,29],[44,1,44,5],[44,6,44,20],[46,13,47,17],[49,13,50,17],[55,22,55,28],[57,25,57,29],[58,25,60,29],[59,15,60,24]]}
[null,"建退共事務受託様式２号"]
[]
[]
[]
[null,"建退共制度に係る被共済者就労状況報告書"]
[null,"（兼建設業退職金共済証紙交付依頼書）"]
[]
[{"$nulls":21},"整理番号",null,null,{"$f":"IF('5様式５号（二次）'!AB3=0,\"\",'5様式５号（二次）'!AB3)","v":""}]
[{"$nulls":21},{"$f":"IF('5様式５号（二次）'!AB4=0,\"\",'5様式５号（二次）'!AB4)","v":"2022-05-01"}]
[]
[]
[]
[null,"交付元事業所",{"$nulls":4},{"$f":"IF('5様式５号（二次）'!B4=0,\"\",'5様式５号（二次）'!B4&\"　　殿\")","v":"ＫＫ建設　株式会社　　殿"}]
[]
[]
[{"$nulls":7},"報告事業所",{"$nulls":3},{"$f":"IF('5様式５号（二次）'!E6=0,\"\",'5様式５号（二次）'!E6)","v":"ＤＤＤ建設　株式会社"}]
[{"$nulls":7},"住         所",{"$nulls":3},{"$f":"IF('5様式５号（二次）'!E7=0,\"\",'5様式５号（二次）'!E7)","v":"〒000-0000　滝川市２丁目３番地"}]
[{"$nulls":7},"電 話 番 号",{"$nulls":3},{"$f":"IF('5様式５号（二次）'!E8=0,\"\",'5様式５号（二次）'!E8)","v":"0125-33-6789"}]
[{"$nulls":7},"共済契約者\n番　　　　号",{"$nulls":3},{"$f":"IF('5様式５号（二次）'!E9=0,\"\",'5様式５号（二次）'!E9)","v":"00-55555"}]
[{"$nulls":7},"建設キャリアアップシステム",{"$nulls":3},{"$f":"IF('5様式５号（二次）'!E10=0,\"\",'5様式５号（二次）'!E10)","v":123456789}]
[{"$nulls":7},"事業者ⅠD"]
[{"$nulls":7},"工事番号および",{"$nulls":3},{"$f":"IF('5様式５号（二次）'!E12=0,\"\",'5様式５号（二次）'!E12)","v":"１２３４　　経営体　ＫＫ地区　８８工区　工事"}]
[{"$nulls":7},"工   事   名"]
[{"$nulls":7},"工 事 コード",{"$nulls":3},{"$f":"IF('5様式５号（二次）'!E14=0,\"\",'5様式５号（二次）'!E14)","v":""}]
[{"$nulls":7},"建設キャリアアップシステム",{"$nulls":3},{"$f":"IF('5様式５号（二次）'!E15=0,\"\",'5様式５号（二次）'!E15)","v":6677889900}]
[{"$nulls":7},"現 場 Ⅰ D"]
[]
[null,null,"以下のとおり報告します。"]
[]
[{"$nulls":12},"記"]
[]
[null,null,"期　間",null,null,{"$f":"IF('5様式５号（二次）'!Q23=0,\"\",'5様式５号（二次）'!Q23)","v":"2022-04-01"},{"$nulls":6},"～",null,{"$f":"IF('5様式５号（二次）'!Y23=0,\"\",'5様式５号（二次）'!Y23)","v":"2022-04-30"},{"$nulls":9},"現場責任者確認"]
[]
[null,null,"被共済者数",{"$nulls":3},{"$f":"'3共済契約者別一覧'!Z22","v":{"v":20,"d":"20 "}},null,null,"人",null,"延べ就労日数",{"$nulls":4},{"$f":"'3共済契約者別一覧'!AF22","v":{"v":127,"d":"127 "}},null,null,"日"]
[]
[]
[]
[]
[]
[null,"建 設 業 退 職 金 共 済 証 紙 受 領 書"]
[]
[{"$nulls":21},"整理番号",null,null,{"$f":"IF('5様式５号（二次）'!AB3=0,\"\",'5様式５号（二次）'!AB3)","v":""}]
[]
[]
[null,"交付元事業所",{"$nulls":4},{"$f":"IF('5様式５号（二次）'!B4=0,\"\",'5様式５号（二次）'!B4&\"　　殿\")","v":"ＫＫ建設　株式会社　　殿"}]
[]
[{"$nulls":13},{"v":127,"d":"127 "}]
[{"$nulls":10},"１日券",{"$nulls":7},"枚"]
[]
[]
[{"$nulls":10},"１０日券",{"$nulls":7},"枚",{"$nulls":3},{"$f":"IF(AND(N47=\"\",N50=\"\"),\"\",IF(Q34=(N47+(N50*10)),\"\",\"請求に対する受領枚数エラー\"))","v":""}]
[]
[]
[null,null,"上記の共済証紙を受領いたしました。"]
[]
[{"$nulls":22},"2022-05-22"]
[]
[{"$nulls":25},"受領者確認"]
[]
[{"$nulls":15},"ＤＤＤ建設　株式会社"]
[{"$nulls":11},"報告事業所"]

{"sheet":"8様式５号（二次）","index":9,"n_rows":68,"n_cols":39,"rows_kept":68,"merged":[[1,0,1,36],[2,23,2,26],[2,27,2,36],[3,1,3,6],[3,7,3,9],[3,23,3,26],[3,27,3,36],[5,1,5,2],[5,4,5,25],[5,28,5,36],[6,1,6,2],[6,4,6,25],[6,28,7,29],[6,30,7,36],[7,1,7,2],[7,4,7,25],[8,1,8,2],[8,4,8,25],[8,28,10,29],[8,30,10,36],[9,1,9,2],[9,4,10,25],[10,1,10,2],[11,1,11,2],[11,4,12,25],[12,1,12,2],[13,1,13,2],[13,4,13,25],[13,28,13,36],[14,1,14,2],[14,4,15,25],[14,28,16,36],[15,1,15,2],[16,1,16,2],[16,4,16,25],[18,1,18,2],[18,4,18,14],[18,16,18,21],[18,23,18,36],[19,1,19,2],[19,4,19,14],[19,16,19,21],[19,23,19,36],[21,1,21,11],[21,12,21,14],[21,15,21,21],[21,23,21,35],[22,0,23,0],[22,1,23,2],[22,3,23,3],[22,4,23,4],[22,10,22,14],[22,16,22,22],[22,24,22,33],[22,37,23,37],[24,1,24,2],[25,1,25,2],[26,1,26,2],[27,1,27,2],[28,1,28,2],[29,1,29,2],[30,1,30,2],[31,1,31,2],[32,1,32,2],[33,1,33,2],[34,1,34,2],[35,1,35,2],[36,1,36,2],[37,1,37,2],[38,1,38,2],[39,1,39,2],[40,1,40,2],[41,1,41,2],[42,1,42,2],[43,1,43,2],[44,0,44,35],[67,37,68,37]]}
["　　　建退共事務受託様式５号"]
["被共済者就労状況報告書（日別報告様式）"]
[{"$nulls":23},"整理番号",{"$nulls":3},{"$f":"IF('1事務受託様式５号'!AB3=0,\"\",'1事務受託様式５号'!AB3)","v":""}]
[null,{"$f":"IF('1事務受託様式５号'!E6=0,\"\",'1事務受託様式５号'!E6)","v":"ＫＫ建設　株式会社"},{"$nulls":5},"殿",{"$nulls":15},"報告日",{"$nulls":3},"2022-05-03"]
[]
[null,"報告事業所名",null,null,"株式会社　ＢＢＢ組"]
[null,"住所",null,null,"〒555-4444　砂川市東１条１丁目",{"$nulls":23},"　",null,"掛金納付についての\n事務を委託します。"]
[null,"電話番号",null,null,"011-444-6666"]
[null,"共済契約者\n番号",null,null,"77-01234",{"$nulls":23},"　",null,"就労実績の集計に建設\nキャリアアップシステムを\n活用しています。"]
[null,"建設キャリアアップシステム",null,null,987654321]
[null,"事業者ⅠD"]
[null,"工事番号および",null,null,{"$f":"IF('1事務受託様式５号'!E12=0,\"\",'1事務受託様式５号'!E12)","v":"１２３４　　経営体　ＫＫ地区　８８工区　工事"}]
[null,"工事名"]
[null,"工事コード",null,null,{"$f":"IF('1事務受託様式５号'!E14=0,\"\",'1事務受託様式５号'!E14)","v":""},{"$nulls":23},"現場責任者確認"]
[null,"建設キャリアアップシステム",null,null,{"$f":"IF('1事務受託様式５号'!E15=0,\"\",'1事務受託様式５号'!E15)","v":6677889900}]
[null,"現場ⅠD"]
[null,"備考",null,null,{"$f":"IF('1事務受託様式５号'!E17=0,\"\",'1事務受託様式５号'!E17)","v":""}]
[]
[null,"(契約者番号)",null,null,{"$f":"IF('1事務受託様式５号'!E19=0,\"\",'1事務受託様式５号'!E19)","v":"51-00200"},{"$nulls":11},"(契約者番号)",{"$nulls":6},{"$f":"IF('1事務受託様式５号'!X19=0,\"\",'1事務受託様式５号'!X19)","v":"22-33333"}]
[null,"元請事業所名",null,null,{"$f":"IF('1事務受託様式５号'!E20=0,\"\",'1事務受託様式５号'!E20)","v":"株式会社　泰進建設"},{"$nulls":11},"一次事業所名",{"$nulls":6},{"$f":"IF('1事務受託様式５号'!X20=0,\"\",'1事務受託様式５号'!X20)","v":"ＫＫ建設　株式会社"}]
[]
[null,"次の表のとおり、就労実績を報告します。"]
["No.","被共済者番号",null,"項番","氏　名",{"$nulls":5},"就労状況",{"$nulls":5},{"$f":"IF('1事務受託様式５号'!Q23=0,\"\",'1事務受託様式５号'!Q23)","v":"2022-04-01"},{"$nulls":6},"～",{"$f":"IF('1事務受託様式５号'!Y23=0,\"\",'1事務受託様式５号'!Y23)","v":"2022-04-30"},{"$nulls":12},"CCUS"]
[{"$nulls":5},1,2,3,4,5,6,7,8,9,10,11,12,13,14,15,16,17,18,19,20,21,22,23,24,25,26,27,28,29,30,31,"就労日数"]
[1,"55-0022331",null,null,11,{"$nulls":7},1,1,1,1,1,null,null,1,1,1,1,1,{"$nulls":12},{"$f":"SUM(F25:AJ25)","v":10},"○",{"$f":"IF(E25=\"\",0,1)","v":1}]
[2,"55-0022332",null,null,22,1,1,1,1,1,null,null,1,1,1,1,1,{"$nulls":19},{"$f":"SUM(F26:AJ26)","v":10},"○",1]
[3,"55-0022333",null,null,33,{"$nulls":7},1,1,1,1,1,{"$nulls":9},1,1,1,1,1,{"$nulls":5},10,"○",1]
[4,"55-0022334",null,null,44,{"$nulls":7},1,1,1,1,1,null,null,1,1,1,1,1,null,null,1,1,1,1,1,{"$nulls":5},15,"　",1]
[5,"55-0022335",null,null,55,{"$nulls":14},1,1,1,1,1,{"$nulls":12},5,"　",1]
[6,"55-0022336",null,null,66,null,null,1,1,1,null,null,1,1,1,1,1,{"$nulls":19},8,"　",1]
[7,"55-0022337",null,null,77,{"$nulls":14},1,1,1,1,1,null,null,1,1,1,1,{"$nulls":6},9,"　",1]
[8,"55-0022338",null,null,88,{"$nulls":14},1,1,1,1,{"$nulls":13},4,"　",1]
[9,"55-0022339",null,null,99,{"$nulls":9},1,1,1,null,null,1,1,1,1,{"$nulls":13},7,"　",1]
[10,"55-0022340",null,null,1010,{"$nulls":14},1,1,1,1,1,{"$nulls":3},1,1,1,1,{"$nulls":5},9,"　",1]
[11,"55-0022341",null,null,"ああああ",1,1,1,1,1,null,null,1,1,1,{"$nulls":4},1,1,1,1,1,{"$nulls":12},13,"　",1]
[12,"55-0022342",null,null,"いいいい",{"$nulls":21},1,1,1,1,1,{"$nulls":5},5,"　",1]
[13,"55-0022343",null,null,"うううう",{"$nulls":21},1,{"$nulls":9},1,"　",1]
[14,"55-0022344",null,null,"ええええ",{"$nulls":6},1,1,{"$nulls":13},1,1,1,1,1,{"$nulls":5},7,"　",1]
[15,"55-0022345",null,null,"おおおお",{"$nulls":14},1,1,1,1,1,null,null,1,1,1,1,1,{"$nulls":5},10,"　",1]
[16,"55-0022346",null,null,"かかかか",null,null,1,1,1,null,1,1,1,1,1,{"$nulls":20},8,"　",1]
[17,"55-0022347",null,null,"きききき",1,1,1,1,1,{"$nulls":16},1,1,1,1,1,null,null,1,null,null,11,"　",1]
[18,"55-0022348",null,null,"くくくく",1,1,{"$nulls":6},1,1,1,{"$nulls":18},1,null,6,"　",1]
[19,"55-0022349",null,null,"けけけけ",1,1,1,1,1,{"$nulls":3},1,1,1,{"$nulls":10},1,1,1,{"$nulls":7},11,"○",1]
[20,"55-0022350",null,null,"ここここ",{"$nulls":6},1,1,1,1,1,{"$nulls":5},1,1,1,{"$nulls":12},8,"　",1]
["総合計",{"$nulls":35},{"$f":"SUM(AK25:AK44)","v":167},{"$f":"COUNTIF(AL25:AL44,\"○\")","v":4},{"$f":"SUM(AM25:AM44)","v":20}]
{"$rows_empty":22}
[{"$nulls":37},"CCUS"]

{"sheet":"9様式４号（二次）","index":10,"n_rows":68,"n_cols":39,"rows_kept":68,"merged":[[1,0,1,36],[2,23,2,26],[2,27,2,36],[3,1,3,15],[3,23,3,26],[3,27,3,36],[5,1,5,2],[5,4,5,25],[5,28,5,36],[6,1,6,2],[6,4,6,25],[6,28,7,29],[6,30,7,36],[7,1,7,2],[7,4,7,25],[8,1,8,2],[8,4,8,25],[8,28,10,29],[8,30,10,36],[9,1,9,2],[9,4,10,25],[10,1,10,2],[11,1,11,2],[11,4,12,25],[12,1,12,2],[13,1,13,2],[13,4,13,25],[13,28,13,36],[14,1,14,2],[14,4,15,25],[14,28,16,36],[15,1,15,2],[16,1,16,2],[16,4,16,25],[18,1,18,2],[18,4,18,14],[18,15,18,21],[18,23,18,36],[19,1,19,2],[19,4,19,14],[19,15,19,21],[19,23,19,36],[21,8,21,11],[21,12,21,14],[21,15,21,21],[21,23,21,32],[22,0,23,0],[22,1,23,2],[22,3,23,3],[22,4,23,9],[22,10,23,15],[22,16,23,32],[22,33,22,36],[22,37,23,37],[23,33,23,36],[24,1,24,2],[24,4,24,9],[24,10,24,15],[24,16,24,32],[24,33,24,36],[25,1,25,2],[25,4,25,9],[25,10,25,15],[25,16,25,32],[25,33,25,36],[26,1,26,2],[26,4,26,9],[26,10,26,15],[26,16,26,32],[26,33,26,36],[27,1,27,2],[27,4,27,9],[27,10,27,15],[27,16,27,32],[27,33,27,36],[28,1,28,2],[28,4,28,9],[28,10,28,15],[28,16,28,32],[28,33,28,36],[29,1,29,2],[29,4,29,9],[29,10,29,15],[29,16,29,32],[29,33,29,36],[30,1,30,2],[30,4,30,9],[30,10,30,15],[30,16,30,32],[30,33,30,36],[31,1,31,2],[31,4,31,9],[31,10,31,15],[31,16,31,32],[31,33,31,36],[32,1,32,2],[32,4,32,9],[32,10,32,15],[32,16,32,32],[32,33,32,36],[33,1,33,2],[33,4,33,9],[33,10,33,15],[33,16,33,32],[33,33,33,36],[34,1,34,2],[34,4,34,9],[34,10,34,15],[34,16,34,32],[34,33,34,36],[35,1,35,2],[35,4,35,9],[35,10,35,15],[35,16,35,32],[35,33,35,36],[36,1,36,2],[36,4,36,9],[36,10,36,15],[36,16,36,32],[36,33,36,36],[37,1,37,2],[37,4,37,9],[37,10,37,15],[37,16,37,32],[37,33,37,36],[38,1,38,2],[38,4,38,9],[38,10,38,15],[38,16,38,32],[38,33,38,36],[39,1,39,2],[39,4,39,9],[39,10,39,15],[39,16,39,32],[39,33,39,36],[40,1,40,2],[40,4,40,9],[40,10,40,15],[40,16,40,32],[40,33,40,36],[41,1,41,2],[41,4,41,9],[41,10,41,15],[41,16,41,32],[41,33,41,36],[42,1,42,2],[42,4,42,9],[42,10,42,15],[42,16,42,32],[42,33,42,36],[43,1,43,2],[43,4,43,9],[43,10,43,15],[43,16,43,32],[43,33,43,36],[44,0,44,32],[44,33,44,36],[67,37,68,37]]}
["　　　建退共事務受託様式４号"]
["被共済者就労状況報告書（月別報告様式）"]
[{"$nulls":23},"整理番号",{"$nulls":3},{"$f":"IF('8様式５号（二次）'!AB3=0,\"\",'8様式５号（二次）'!AB3)","v":""}]
[null,{"$f":"IF('8様式５号（二次）'!B4=0,\"\",'8様式５号（二次）'!B4&\"　　殿\")","v":"ＫＫ建設　株式会社　　殿"},{"$nulls":21},"報告日",{"$nulls":3},{"$f":"IF('8様式５号（二次）'!AB4=0,\"\",'8様式５号（二次）'!AB4)","v":"2022-05-03"}]
[]
[null,"報告事業所名",null,null,{"$f":"IF('8様式５号（二次）'!E6=0,\"\",'8様式５号（二次）'!E6)","v":"株式会社　ＢＢＢ組"}]
[null,"住所",null,null,{"$f":"IF('8様式５号（二次）'!E7=0,\"\",'8様式５号（二次）'!E7)","v":"〒555-4444　砂川市東１条１丁目"},{"$nulls":23},"　",null,"掛金納付についての\n事務を委託します。"]
[null,"電話番号",null,null,{"$f":"IF('8様式５号（二次）'!E8=0,\"\",'8様式５号（二次）'!E8)","v":"011-444-6666"}]
[null,"共済契約者\n番号",null,null,{"$f":"IF('8様式５号（二次）'!E9=0,\"\",'8様式５号（二次）'!E9)","v":"77-01234"},{"$nulls":23},"　",null,"就労実績の集計に建設\nキャリアアップシステムを\n活用しています。"]
[null,"建設キャリアアップシステム",null,null,{"$f":"IF('8様式５号（二次）'!E10=0,\"\",'8様式５号（二次）'!E10)","v":987654321}]
[null,"事業者ⅠD"]
[null,"工事番号および",null,null,{"$f":"IF('5様式５号（二次）'!E12=0,\"\",'5様式５号（二次）'!E12)","v":"１２３４　　経営体　ＫＫ地区　８８工区　工事"}]
[null,"工事名"]
[null,"工事コード",null,null,{"$f":"IF('5様式５号（二次）'!E14=0,\"\",'5様式５号（二次）'!E14)","v":""},{"$nulls":23},"現場責任者確認"]
[null,"建設キャリアアップシステム",null,null,{"$f":"IF('5様式５号（二次）'!E15=0,\"\",'5様式５号（二次）'!E15)","v":6677889900}]
[null,"現場ⅠD"]
[null,"備考",null,null,{"$f":"IF('5様式５号（二次）'!E17=0,\"\",'5様式５号（二次）'!E17)","v":""}]
[]
[null,"(共済契約者番号)",null,null,{"$f":"IF('1事務受託様式５号'!E19=0,\"\",'1事務受託様式５号'!E19)","v":"51-00200"},{"$nulls":10},"(共済契約者番号)",{"$nulls":7},{"$f":"IF('1事務受託様式５号'!X19=0,\"\",'1事務受託様式５号'!X19)","v":"22-33333"}]
[null,"元請事業所名",null,null,{"$f":"IF('1事務受託様式５号'!E20=0,\"\",'1事務受託様式５号'!E20)","v":"株式会社　泰進建設"},{"$nulls":10},"一次事業所名",{"$nulls":7},{"$f":"IF('1事務受託様式５号'!X20=0,\"\",'1事務受託様式５号'!X20)","v":"ＫＫ建設　株式会社"}]
[]
[null,"次の表のとおり、就労実績を報告します。",{"$nulls":6},"報告期間：",{"$nulls":6},{"$f":"IF('5様式５号（二次）'!Q23=0,\"\",'5様式５号（二次）'!Q23)","v":"2022-04-01"},{"$nulls":6},"～",{"$f":"IF('5様式５号（二次）'!Y23=0,\"\",'5様式５号（二次）'!Y23)","v":"2022-04-30"}]
["No.","共済契約者番号",null,"項番","共済契約者名",{"$nulls":5},"被共済者番号",{"$nulls":5},"被共済者名",{"$nulls":16},"就労日数",{"$nulls":3},"CCUS"]
[{"$nulls":33},"320円"]
[1,{"$f":"E9","v":"77-01234"},null,null,{"$f":"E6","v":"株式会社　ＢＢＢ組"},{"$nulls":5},{"$f":"IF('8様式５号（二次）'!B25=0,\"\",'8様式５号（二次）'!B25)","v":"55-0022331"},{"$nulls":5},{"$f":"IF('8様式５号（二次）'!E25=0,\"\",'8様式５号（二次）'!E25)","v":11},{"$nulls":16},{"$f":"IF('8様式５号（二次）'!AK25=0,\"\",'8様式５号（二次）'!AK25)","v":10},{"$nulls":3},"○",{"$f":"IF(Q25=\"\",0,1)","v":1}]
[2,{"$f":"E9","v":"77-01234"},null,null,{"$f":"E6","v":"株式会社　ＢＢＢ組"},{"$nulls":5},{"$f":"IF('8様式５号（二次）'!B26=0,\"\",'8様式５号（二次）'!B26)","v":"55-0022332"},{"$nulls":5},{"$f":"IF('8様式５号（二次）'!E26=0,\"\",'8様式５号（二次）'!E26)","v":22},{"$nulls":16},{"$f":"IF('8様式５号（二次）'!AK26=0,\"\",'8様式５号（二次）'!AK26)","v":10},{"$nulls":3},"○",{"$f":"IF(Q26=\"\",0,1)","v":1}]
[3,{"$f":"E9","v":"77-01234"},null,null,{"$f":"E6","v":"株式会社　ＢＢＢ組"},{"$nulls":5},{"$f":"IF('8様式５号（二次）'!B27=0,\"\",'8様式５号（二次）'!B27)","v":"55-0022333"},{"$nulls":5},{"$f":"IF('8様式５号（二次）'!E27=0,\"\",'8様式５号（二次）'!E27)","v":33},{"$nulls":16},{"$f":"IF('8様式５号（二次）'!AK27=0,\"\",'8様式５号（二次）'!AK27)","v":10},{"$nulls":3},"○",1]
[4,{"$f":"E9","v":"77-01234"},null,null,{"$f":"E6","v":"株式会社　ＢＢＢ組"},{"$nulls":5},{"$f":"IF('8様式５号（二次）'!B28=0,\"\",'8様式５号（二次）'!B28)","v":"55-0022334"},{"$nulls":5},{"$f":"IF('8様式５号（二次）'!E28=0,\"\",'8様式５号（二次）'!E28)","v":44},{"$nulls":16},{"$f":"IF('8様式５号（二次）'!AK28=0,\"\",'8様式５号（二次）'!AK28)","v":15},{"$nulls":3},"　",1]
[5,{"$f":"E9","v":"77-01234"},null,null,{"$f":"E6","v":"株式会社　ＢＢＢ組"},{"$nulls":5},{"$f":"IF('8様式５号（二次）'!B29=0,\"\",'8様式５号（二次）'!B29)","v":"55-0022335"},{"$nulls":5},{"$f":"IF('8様式５号（二次）'!E29=0,\"\",'8様式５号（二次）'!E29)","v":55},{"$nulls":16},{"$f":"IF('8様式５号（二次）'!AK29=0,\"\",'8様式５号（二次）'!AK29)","v":5},{"$nulls":3},"　",1]
[6,{"$f":"E9","v":"77-01234"},null,null,{"$f":"E6","v":"株式会社　ＢＢＢ組"},{"$nulls":5},{"$f":"IF('8様式５号（二次）'!B30=0,\"\",'8様式５号（二次）'!B30)","v":"55-0022336"},{"$nulls":5},{"$f":"IF('8様式５号（二次）'!E30=0,\"\",'8様式５号（二次）'!E30)","v":66},{"$nulls":16},{"$f":"IF('8様式５号（二次）'!AK30=0,\"\",'8様式５号（二次）'!AK30)","v":8},{"$nulls":3},"　",1]
[7,{"$f":"E9","v":"77-01234"},null,null,{"$f":"E6","v":"株式会社　ＢＢＢ組"},{"$nulls":5},{"$f":"IF('8様式５号（二次）'!B31=0,\"\",'8様式５号（二次）'!B31)","v":"55-0022337"},{"$nulls":5},{"$f":"IF('8様式５号（二次）'!E31=0,\"\",'8様式５号（二次）'!E31)","v":77},{"$nulls":16},{"$f":"IF('8様式５号（二次）'!AK31=0,\"\",'8様式５号（二次）'!AK31)","v":9},{"$nulls":3},"　",1]
[8,{"$f":"E9","v":"77-01234"},null,null,{"$f":"E6","v":"株式会社　ＢＢＢ組"},{"$nulls":5},{"$f":"IF('8様式５号（二次）'!B32=0,\"\",'8様式５号（二次）'!B32)","v":"55-0022338"},{"$nulls":5},{"$f":"IF('8様式５号（二次）'!E32=0,\"\",'8様式５号（二次）'!E32)","v":88},{"$nulls":16},{"$f":"IF('8様式５号（二次）'!AK32=0,\"\",'8様式５号（二次）'!AK32)","v":4},{"$nulls":3},"　",1]
[9,{"$f":"E9","v":"77-01234"},null,null,{"$f":"E6","v":"株式会社　ＢＢＢ組"},{"$nulls":5},{"$f":"IF('8様式５号（二次）'!B33=0,\"\",'8様式５号（二次）'!B33)","v":"55-0022339"},{"$nulls":5},{"$f":"IF('8様式５号（二次）'!E33=0,\"\",'8様式５号（二次）'!E33)","v":99},{"$nulls":16},{"$f":"IF('8様式５号（二次）'!AK33=0,\"\",'8様式５号（二次）'!AK33)","v":7},{"$nulls":3},"　",1]
[10,{"$f":"E9","v":"77-01234"},null,null,{"$f":"E6","v":"株式会社　ＢＢＢ組"},{"$nulls":5},{"$f":"IF('8様式５号（二次）'!B34=0,\"\",'8様式５号（二次）'!B34)","v":"55-0022340"},{"$nulls":5},{"$f":"IF('8様式５号（二次）'!E34=0,\"\",'8様式５号（二次）'!E34)","v":1010},{"$nulls":16},{"$f":"IF('8様式５号（二次）'!AK34=0,\"\",'8様式５号（二次）'!AK34)","v":9},{"$nulls":3},"　",1]
[11,{"$f":"E9","v":"77-01234"},null,null,{"$f":"E6","v":"株式会社　ＢＢＢ組"},{"$nulls":5},{"$f":"IF('8様式５号（二次）'!B35=0,\"\",'8様式５号（二次）'!B35)","v":"55-0022341"},{"$nulls":5},{"$f":"IF('8様式５号（二次）'!E35=0,\"\",'8様式５号（二次）'!E35)","v":"ああああ"},{"$nulls":16},{"$f":"IF('8様式５号（二次）'!AK35=0,\"\",'8様式５号（二次）'!AK35)","v":13},{"$nulls":3},"　",1]
[12,{"$f":"E9","v":"77-01234"},null,null,{"$f":"E6","v":"株式会社　ＢＢＢ組"},{"$nulls":5},{"$f":"IF('8様式５号（二次）'!B36=0,\"\",'8様式５号（二次）'!B36)","v":"55-0022342"},{"$nulls":5},{"$f":"IF('8様式５号（二次）'!E36=0,\"\",'8様式５号（二次）'!E36)","v":"いいいい"},{"$nulls":16},{"$f":"IF('8様式５号（二次）'!AK36=0,\"\",'8様式５号（二次）'!AK36)","v":5},{"$nulls":3},"　",1]
[13,{"$f":"E9","v":"77-01234"},null,null,{"$f":"E6","v":"株式会社　ＢＢＢ組"},{"$nulls":5},{"$f":"IF('8様式５号（二次）'!B37=0,\"\",'8様式５号（二次）'!B37)","v":"55-0022343"},{"$nulls":5},{"$f":"IF('8様式５号（二次）'!E37=0,\"\",'8様式５号（二次）'!E37)","v":"うううう"},{"$nulls":16},{"$f":"IF('8様式５号（二次）'!AK37=0,\"\",'8様式５号（二次）'!AK37)","v":1},{"$nulls":3},"　",1]
[14,{"$f":"E9","v":"77-01234"},null,null,{"$f":"E6","v":"株式会社　ＢＢＢ組"},{"$nulls":5},{"$f":"IF('8様式５号（二次）'!B38=0,\"\",'8様式５号（二次）'!B38)","v":"55-0022344"},{"$nulls":5},{"$f":"IF('8様式５号（二次）'!E38=0,\"\",'8様式５号（二次）'!E38)","v":"ええええ"},{"$nulls":16},{"$f":"IF('8様式５号（二次）'!AK38=0,\"\",'8様式５号（二次）'!AK38)","v":7},{"$nulls":3},"　",1]
[15,{"$f":"E9","v":"77-01234"},null,null,{"$f":"E6","v":"株式会社　ＢＢＢ組"},{"$nulls":5},{"$f":"IF('8様式５号（二次）'!B39=0,\"\",'8様式５号（二次）'!B39)","v":"55-0022345"},{"$nulls":5},{"$f":"IF('8様式５号（二次）'!E39=0,\"\",'8様式５号（二次）'!E39)","v":"おおおお"},{"$nulls":16},{"$f":"IF('8様式５号（二次）'!AK39=0,\"\",'8様式５号（二次）'!AK39)","v":10},{"$nulls":3},"　",1]
[16,{"$f":"E9","v":"77-01234"},null,null,{"$f":"E6","v":"株式会社　ＢＢＢ組"},{"$nulls":5},{"$f":"IF('8様式５号（二次）'!B40=0,\"\",'8様式５号（二次）'!B40)","v":"55-0022346"},{"$nulls":5},{"$f":"IF('8様式５号（二次）'!E40=0,\"\",'8様式５号（二次）'!E40)","v":"かかかか"},{"$nulls":16},{"$f":"IF('8様式５号（二次）'!AK40=0,\"\",'8様式５号（二次）'!AK40)","v":8},{"$nulls":3},"　",1]
[17,{"$f":"E9","v":"77-01234"},null,null,{"$f":"E6","v":"株式会社　ＢＢＢ組"},{"$nulls":5},{"$f":"IF('8様式５号（二次）'!B41=0,\"\",'8様式５号（二次）'!B41)","v":"55-0022347"},{"$nulls":5},{"$f":"IF('8様式５号（二次）'!E41=0,\"\",'8様式５号（二次）'!E41)","v":"きききき"},{"$nulls":16},{"$f":"IF('8様式５号（二次）'!AK41=0,\"\",'8様式５号（二次）'!AK41)","v":11},{"$nulls":3},"　",1]
[18,{"$f":"E9","v":"77-01234"},null,null,{"$f":"E6","v":"株式会社　ＢＢＢ組"},{"$nulls":5},{"$f":"IF('8様式５号（二次）'!B42=0,\"\",'8様式５号（二次）'!B42)","v":"55-0022348"},{"$nulls":5},{"$f":"IF('8様式５号（二次）'!E42=0,\"\",'8様式５号（二次）'!E42)","v":"くくくく"},{"$nulls":16},{"$f":"IF('8様式５号（二次）'!AK42=0,\"\",'8様式５号（二次）'!AK42)","v":6},{"$nulls":3},"　",1]
[19,{"$f":"E9","v":"77-01234"},null,null,{"$f":"E6","v":"株式会社　ＢＢＢ組"},{"$nulls":5},{"$f":"IF('8様式５号（二次）'!B43=0,\"\",'8様式５号（二次）'!B43)","v":"55-0022349"},{"$nulls":5},{"$f":"IF('8様式５号（二次）'!E43=0,\"\",'8様式５号（二次）'!E43)","v":"けけけけ"},{"$nulls":16},{"$f":"IF('8様式５号（二次）'!AK43=0,\"\",'8様式５号（二次）'!AK43)","v":11},{"$nulls":3},"○",1]
[20,{"$f":"E9","v":"77-01234"},null,null,{"$f":"E6","v":"株式会社　ＢＢＢ組"},{"$nulls":5},{"$f":"IF('8様式５号（二次）'!B44=0,\"\",'8様式５号（二次）'!B44)","v":"55-0022350"},{"$nulls":5},{"$f":"IF('8様式５号（二次）'!E44=0,\"\",'8様式５号（二次）'!E44)","v":"ここここ"},{"$nulls":16},{"$f":"IF('8様式５号（二次）'!AK44=0,\"\",'8様式５号（二次）'!AK44)","v":8},{"$nulls":3},"　",1]
["総合計",{"$nulls":32},{"$f":"SUM(AH25:AK44)","v":167},{"$nulls":3},{"$f":"COUNTIF(AL25:AL44,\"○\")","v":4},{"$f":"SUM(AM25:AM44)","v":20}]
{"$rows_empty":22}
[{"$nulls":37},"CCUS"]

{"sheet":"10様式２号（二次）","index":11,"n_rows":61,"n_cols":26,"rows_kept":61,"merged":[[4,1,4,29],[5,1,5,29],[7,24,7,29],[8,21,8,29],[11,1,11,2],[12,1,12,5],[12,6,12,20],[15,7,15,10],[15,11,15,29],[16,7,16,10],[16,11,16,29],[17,7,17,10],[17,11,17,29],[18,7,18,10],[18,11,18,29],[19,7,19,10],[19,11,20,29],[20,7,20,10],[21,7,21,10],[21,11,22,29],[22,7,22,10],[23,7,23,10],[23,11,23,29],[24,7,24,10],[24,11,25,29],[25,7,25,10],[31,5,31,11],[31,14,31,20],[31,24,31,29],[33,6,33,8],[33,16,33,18],[39,1,39,29],[41,24,41,29],[44,1,44,5],[44,6,44,20],[46,13,47,17],[49,13,50,17],[55,22,55,28],[57,25,57,29],[58,25,60,29],[59,15,60,24]]}
[null,"建退共事務受託様式２号"]
[]
[]
[]
[null,"建退共制度に係る被共済者就労状況報告書"]
[null,"（兼建設業退職金共済証紙交付依頼書）"]
[]
[{"$nulls":21},"整理番号",null,null,{"$f":"IF('8様式５号（二次）'!AB3=0,\"\",'8様式５号（二次）'!AB3)","v":""}]
[{"$nulls":21},{"$f":"IF('8様式５号（二次）'!AB4=0,\"\",'8様式５号（二次）'!AB4)","v":"2022-05-03"}]
[]
[]
[]
[null,"交付元事業所",{"$nulls":4},{"$f":"IF('8様式５号（二次）'!B4=0,\"\",'8様式５号（二次）'!B4&\"　　殿\")","v":"ＫＫ建設　株式会社　　殿"}]
[]
[]
[{"$nulls":7},"報告事業所",{"$nulls":3},{"$f":"IF('8様式５号（二次）'!E6=0,\"\",'8様式５号（二次）'!E6)","v":"株式会社　ＢＢＢ組"}]
[{"$nulls":7},"住         所",{"$nulls":3},{"$f":"IF('8様式５号（二次）'!E7=0,\"\",'8様式５号（二次）'!E7)","v":"〒555-4444　砂川市東１条１丁目"}]
[{"$nulls":7},"電 話 番 号",{"$nulls":3},{"$f":"IF('8様式５号（二次）'!E8=0,\"\",'8様式５号（二次）'!E8)","v":"011-444-6666"}]
[{"$nulls":7},"共済契約者\n番　　　　号",{"$nulls":3},{"$f":"IF('8様式５号（二次）'!E9=0,\"\",'8様式５号（二次）'!E9)","v":"77-01234"}]
[{"$nulls":7},"建設キャリアアップシステム",{"$nulls":3},{"$f":"IF('8様式５号（二次）'!E10=0,\"\",'8様式５号（二次）'!E10)","v":987654321}]
[{"$nulls":7},"事業者ⅠD"]
[{"$nulls":7},"工事番号および",{"$nulls":3},{"$f":"IF('8様式５号（二次）'!E12=0,\"\",'8様式５号（二次）'!E12)","v":"１２３４　　経営体　ＫＫ地区　８８工区　工事"}]
[{"$nulls":7},"工   事   名"]
[{"$nulls":7},"工 事 コード",{"$nulls":3},{"$f":"IF('8様式５号（二次）'!E14=0,\"\",'8様式５号（二次）'!E14)","v":""}]
[{"$nulls":7},"建設キャリアアップシステム",{"$nulls":3},{"$f":"IF('8様式５号（二次）'!E15=0,\"\",'8様式５号（二次）'!E15)","v":6677889900}]
[{"$nulls":7},"現 場 Ⅰ D"]
[]
[null,null,"以下のとおり報告します。"]
[]
[{"$nulls":12},"記"]
[]
[null,null,"期　間",null,null,{"$f":"IF('8様式５号（二次）'!Q23=0,\"\",'8様式５号（二次）'!Q23)","v":"2022-04-01"},{"$nulls":6},"～",null,{"$f":"IF('8様式５号（二次）'!Y23=0,\"\",'8様式５号（二次）'!Y23)","v":"2022-04-30"},{"$nulls":9},"現場責任者確認"]
[]
[null,null,"被共済者数",{"$nulls":3},{"$f":"'3共済契約者別一覧'!Z23","v":{"v":20,"d":"20 "}},null,null,"人",null,"延べ就労日数",{"$nulls":4},{"$f":"'3共済契約者別一覧'!AF23","v":{"v":167,"d":"167 "}},null,null,"日"]
[]
[]
[]
[]
[]
[null,"建 設 業 退 職 金 共 済 証 紙 受 領 書"]
[]
[{"$nulls":21},"整理番号",null,null,{"$f":"IF('8様式５号（二次）'!AB3=0,\"\",'8様式５号（二次）'!AB3)","v":""}]
[]
[]
[null,"交付元事業所",{"$nulls":4},{"$f":"IF('8様式５号（二次）'!B4=0,\"\",'8様式５号（二次）'!B4&\"　　殿\")","v":"ＫＫ建設　株式会社　　殿"}]
[]
[{"$nulls":13},{"v":167,"d":"167 "}]
[{"$nulls":10},"１日券",{"$nulls":7},"枚"]
[]
[]
[{"$nulls":10},"１０日券",{"$nulls":7},"枚",{"$nulls":3},{"$f":"IF(AND(N47=\"\",N50=\"\"),\"\",IF(Q34=(N47+(N50*10)),\"\",\"請求に対する受領枚数エラー\"))","v":""}]
[]
[]
[null,null,"上記の共済証紙を受領いたしました。"]
[]
[{"$nulls":22},"2022-05-22"]
[]
[{"$nulls":25},"受領者確認"]
[]
[{"$nulls":15},"株式会社　ＢＢＢ組"]
[{"$nulls":11},"報告事業所"]